{"text_format":"1","workbook":"xlsx","n_sheets":20,"sheets":["Cover","Instructions","RevisionNotes","Fx72x_Panel","FS20_Constants","Panel_values","CardCage2_Ref","CardCage5_Ref","CardCageCPU_Ref","FDnet_Ref","FDnet_Constants","MS9I_Ref","Collective_Ref","AnalogPLUS_Ref","AnalogPLUS_Calc_Ref","AnalogPLUS_Constants","Interactive_Ref","Interactive_Calc_Ref","Interactive_Constants","Testing_Translation"],"not_rendered":{"charts":0,"images":96,"macros":1,"external_links":0,"defined_names":264,"comments":8,"pivot_tables":0},"unopened":[],"bounds":{"document_bytes":16777216,"sheet_cells":100000,"rows_first":2000,"rows_last":500,"rows_between":2000,"halvings":0,"cell_chars":16384,"cell_head_chars":4096},"cells_cut":0,"cells_raw":0,"read":"whole","date_system":"1900"}

{"sheet":"Cover","index":0,"n_rows":397,"n_cols":4,"rows_kept":397,"cut":false,"hidden":false,"merged":[]}
[]
[]
[]
[]
[]
[]
[]
[]
[]
[]
[]
[]
[]
[]
[]
[]
[]
[]
[]
[]
[]
[]
["FS720"]
[]
["Fire detection system"]
[]
["FX7210 - Cerberus Quantities Tool"]
[]
["IP7 - version p - 1.4"]
[]
[]
[]
[]
[]
[]
[]
[]
[]
[]
[]
[]
[]
[]
[]
[]
[]
[]
[]
[]
[]
[]
[]
[]
[]
[]
[null,null,null,"Building Technologies"]
[]
[]
[]
[]
[]
[]
[]
[]
[]
[]
[]
[]
[]
[]
[]
[]
[]
[]
[]
[]
[]
[]
[]
[]
[]
[]
[]
[]
[]
[]
[]
[]
[]
[]
[]
[]
[]
[]
[]
[]
[]
[]
[]
[]
[]
[]
[]
[]
[]
[]
[]
[]
[]
[]
[]
[]
[]
[]
[]
[]
[]
[]
[]
[]
[]
[]
[]
[]
[]
[]
[]
[]
[]
[]
[]
[]
[]
[]
[]
[]
[]
[]
[]
[]
[]
[]
[]
[]
[]
[]
[]
[]
[]
[]
[]
[]
[]
[]
[]
[]
[]
[]
[]
[]
[]
[]
[]
[]
[]
[]
[]
[]
[]
[]
[]
[]
[]
[]
[]
[]
[]
[]
[]
[]
[]
[]
[]
[]
[]
[]
[]
[]
[]
[]
[]
[]
[]
[]
[]
[]
[]
[]
[]
[]
[]
[]
[]
[]
[]
[]
[]
[]
[]
[]
[]
[]
[]
[]
[]
[]
[]
[]
[]
[]
[]
[]
[]
[]
[]
[]
[]
[]
[]
[]
[]
[]
[]
[]
[]
[]
[]
[]
[]
[]
[]
[]
[]
[]
[]
[]
[]
[]
[]
[]
[]
[]
[]
[]
[]
[]
[]
[]
[]
[]
[]
[]
[]
[]
[]
[]
[]
[]
[]
[]
[]
[]
[]
[]
[]
[]
[]
[]
[]
[]
[]
[]
[]
[]
[]
[]
[]
[]
[]
[]
[]
[]
[]
[]
[]
[]
[]
[]
[]
[]
[]
[]
[]
[]
[]
[]
[]
[]
[]
[]
[]
[]
[]
[]
[]
[]
[]
[]
[]
[]
[]
[]
[]
[]
[]
[]
[]
[]
[]
[]
[]
[]
[]
[]
[]
[]
[]
[]
[]
[]
[]
[]
[]
[]
[]
[]
[]
[]
[]
[]
[]
[]
[]
[]
[]
[]
[]
[]
[]
[]
[]
[]
[]
[]
[]
[]
[]
[]
[]
[]
[]
[]
[]
[]
[]
[]
[]
[]
[]
[]
[]
[]
[]
[]
[]
[]
[]
[]
[]
[]
[]
[]
[]
[]
[]
[null,null,0]
[null,null,0]

{"sheet":"Instructions","index":1,"n_rows":43,"n_cols":1,"rows_kept":43,"cut":false,"hidden":false,"merged":[]}
["General information:"]
["The project planning of a FS720 fire panel can be performed as follows:"]
["- completely with this tool"]
["- with the instructions provided in the document A6V10210362 \"Planning\""]
["It must be taken into account that the system limitations are not included in this tool. They must be taken from the document A6V10210362 \"Planning\""]
[]
["Purpose:"]
["With the project planning of the fire panel the load of the line card is verified, as well as the load of the fire panel and the necessary batteries are verified. This results in the definite ordering"]
[]
["Procedure:"]
["1. Define operation units (see document A6V10210362)"]
["1.1 Define the places in the building where panels (control units, terminals) are desired or required"]
["1.2 Define visibility for operation units"]
["1.3 Define type for operation units (panels, indications, visualizer, floor repeater panels, …)"]
["1.4 Define supply (external, internal) of operation units"]
[]
["2. Planning of stations (see document A6V10210362)"]
["2.1 Define type of station, dependent of # of detectors and PMI requirements"]
["--> Additional sheets are generated"]
["2.2 Define line cards on card cage if available (depends on station type)"]
["--> Additional sheets are generated"]
[]
["3. Planning of detector lines (see document A6V10210362)"]
["3.1 Define type and position of the detector line devices in the building"]
["3.2 Define line topology, line card assignment and cabling for all necessary line cards"]
["--> Calculate every line card with additional sheets"]
["--> All line card configurations must be valid (\"Green Calculation Button\") before continuing"]
[]
["4. Planning standby-time"]
["4.1 Enter other loads from outputs and options on \"Fx72x_Panel\" sheets if available"]
["4.2 Enter required standby- and alarm-time"]
["4.3. Push \"Calculation Button\" for updating values from additional sheets and calculate correct values"]
["--> If the panel configuration is not valid \"Red/Orange Calculation Button\" check"]
["… power supply and batteries, change with button if possible (depends on used station, power supply, …)"]
["… that all panel status information is ok"]
["--> With column \"Try other settings\" it's possible to check if actual config is possible with other housing"]
["… result has no impact to general configuration"]
["--> Calculate every station in the spread-sheet \"Fx72x_Panel\""]
["--> The panel configuration must be valid \"Green Calculation Button\" before continuing"]
[]
["Please consider:"]
["It is not possible to check all interactions of all options with each other. Restrictions in the use of options together are noted in the document A6V10210362 \"Planning\" and A6V10210390 \"Installation\"."]
["This excel spreadsheets does not contain any overwrite protection for cells and formulas. This is, that you can create your own specific template."]

{"sheet":"RevisionNotes","index":2,"n_rows":414,"n_cols":3,"rows_kept":414,"cut":false,"hidden":true,"merged":[]}
["Current Version:"]
[]
["A6V10211118_p_en_--_FX7210-QuantitiesTool.xls  (23. November 2018)"]
[]
["  Martin Luethi <martin.luethi@siemens.com>"]
["- changelog V1.4:"]
["- correct modulebus 1&2 check:"]
["- modulebus 1: Max. 4 CC5 and 22 Linecard without Ext., with Ext. Max. 2 CC5 and 12 Linecards"]
["- modulebus 2: Max. 4 CC5 and 20 Linecard without Ext., with Ext. Max. 2 CC5 and 10 Linecards"]
["- Change name of “NetworkCommAddOn_ChangePowerSupply” to “NetworkCommAddOn_ChangePS”"]
["- Change name of “PS1ChangePowerSupplyOtherSettings” to “PS1ChangePSotherSettings”"]
["- Change name of “PS2ChangePowerSupplyOtherSettings” to “PS2ChangePSotherSettings”"]
["  Names are too long for correct view and changes into other formats"]
["- Limit max. HelpStatusInformationUserTextMark row hight if too many comments"]
["- Activate created FDnet sheet direct after generation, correct active sheet during _change function calling"]
["- Activate created FDnet sheet direct after generation, correct active sheet during _change function calling"]
["- Add text information for \"Try other settings\""]
["- Correct switch to FT724 with supply failure"]
["- Change format from .xls to .xlsm"]
[]
["  Martin Luethi <martin.luethi@siemens.com>"]
["- changelog V1.3:"]
["- correct some power supply constants at \"GetPowerSupplyData\" function"]
["- correct some housing constants at \"GetHousingData\" function"]
[]
["- changelog V1.2:"]
["- add some small correction (naming, …)"]
["- for FC721, make Networkt at \"Networking&CommunicationPMI\" not visible"]
["- Limit for FDnet stub is set to 64 (instead of 32)"]
[]
["  Martin Luethi <martin.luethi@siemens.com>"]
["- changelog V1.1:"]
["- activate always actual open sheet (Worksheet_Active function must be added to all sheets"]
["- update Fdnet sheet (VBA and excel itself) from "]
["049_FX2010_009716_w_en_--_FX2010-SintesoQuantitiesTool.xls V1.4"]
["- change FT2040/FT2080 comments to FT724"]
["- set battery time to 30h intstead of 24h"]
[]
[]
["  Martin Luethi <martin.luethi@siemens.com>"]
["- changelog V1.0:"]
["- change all necessary data from Sinteso to Cerberus Tool (Excel Sheets and VB)"]
["- improve C-NET handling with all possible configruation"]
[]
[]
[]
["History"]
[]
["Tool generated out of 049_FX2010_009716_w_en_--_FX2010-SintesoQuantitiesTool.xls (3.August 2018) V1.1"]
[]
[]
[]
[]
[]
[]
[]
[]
[]
[]
[]
[]
[]
[]
[]
[]
[]
[]
[]
[]
[]
[]
[]
[]
[]
[]
[]
[]
[]
[]
[]
[]
[]
[]
[]
[]
[]
[]
[]
[]
[]
[]
[]
[]
[]
[]
[]
[]
[]
[]
[]
[]
[]
[]
[]
[]
[]
[]
[]
[]
[]
[]
[]
[]
[]
[]
[]
[]
[]
[]
[]
[]
[]
[]
[]
[]
[]
[]
[]
[]
[]
[]
[]
[]
[]
[]
[]
[]
[]
[]
[]
[]
[]
[]
[]
[]
[]
[]
[]
[]
[]
[]
[]
[]
[]
[]
[]
[]
[]
[]
[]
[]
[]
[]
[]
[]
[]
[]
[]
[]
[]
[]
[]
[]
[]
[]
[]
[]
[]
[]
[]
[]
[]
[]
[]
[]
[]
[]
[]
[]
[]
[]
[]
[]
[]
[]
[]
[]
[]
[]
[]
[]
[]
[]
[]
[]
[]
[]
[]
[]
[]
[]
[]
[]
[]
[]
[]
[]
[]
[]
[]
[]
[]
[]
[]
[]
[]
[]
[]
[]
[]
[]
[]
[]
[]
[]
[]
[]
[]
[]
[]
[]
[]
[]
[]
[]
[]
[]
[]
[]
[]
[]
[]
[]
[]
[]
[]
[]
[]
[]
[]
[]
[]
[]
[]
[]
[]
[]
[]
[]
[]
[]
[]
[]
[]
[]
[]
[]
[]
[]
[]
[]
[]
[]
[]
[]
[]
[]
[]
[]
[]
[]
[]
[]
[]
[]
[]
[]
[]
[]
[]
[]
[]
[]
[]
[]
[]
[]
[]
[]
[]
[]
[]
[]
[]
[]
[]
[]
[]
[]
[]
[]
[]
[]
[]
[]
[]
[]
[]
[]
[]
[]
[]
[]
[]
[]
[]
[]
[]
[]
[]
[]
[]
[]
[]
[]
[]
[]
[]
[]
[]
[]
[]
[]
[]
[]
[]
[]
[]
[]
[]
[]
[]
[]
[]
[]
[]
[]
[]
[]
[]
[]
[]
[]
[]
[]
[]
[]
[]
[]
[]
[]
[]
[]
[]
[]
[]
[]
[]
[]
[]
[]
[]
[]
[]
[]
[]
[]
[]
[]
[]
[]
[]
[]
[]
[]
[]
[]
[]
[]
[]
[]
[]
[null,null,0]
[null,null,0]

{"sheet":"Fx72x_Panel","index":3,"n_rows":608,"n_cols":16,"rows_kept":608,"cut":false,"hidden":false,"merged":[[607,2,607,8],[575,1,575,6],[516,1,516,6],[455,1,455,6],[382,3,382,4],[382,5,382,6],[382,7,382,8],[390,5,390,6],[390,7,390,8],[408,0,408,10],[413,0,413,10],[464,5,464,6],[464,7,464,8],[532,7,532,8],[519,5,519,6],[415,5,415,6],[514,0,514,10],[600,0,600,10],[186,3,186,4],[186,5,186,6],[214,5,214,6],[214,7,214,8],[352,3,352,4],[352,5,352,6],[186,7,186,8],[214,3,214,4],[240,5,240,6],[240,3,240,4],[346,3,346,4],[346,5,346,6],[346,7,346,8],[352,7,352,8],[248,3,248,4],[252,3,252,4],[248,5,248,6],[252,5,252,6],[248,7,248,8],[252,7,252,8],[310,3,310,4],[310,5,310,6],[310,7,310,8],[316,3,316,4],[328,5,328,6],[322,3,322,4],[322,5,322,6],[316,5,316,6],[316,7,316,8],[322,7,322,8],[108,5,108,6],[108,7,108,8],[111,1,111,4],[111,5,111,6],[111,7,111,8],[174,0,174,10],[150,9,155,9],[141,5,141,6],[141,3,141,4],[142,9,147,9],[133,7,133,8],[137,3,137,4],[137,5,137,6],[208,0,208,10],[236,0,236,10],[240,7,240,8],[149,3,149,4],[149,5,149,6],[149,7,149,8],[304,3,304,4],[141,7,141,8],[272,0,272,10],[292,5,292,6],[29,0,29,10],[106,0,106,10],[131,0,131,10],[108,1,108,4],[137,7,137,8],[210,7,210,8],[210,5,210,6],[210,3,210,4],[133,5,133,6],[133,3,133,4],[292,7,292,8],[298,3,298,4],[298,5,298,6],[298,7,298,8],[176,3,176,4],[176,5,176,6],[176,7,176,8],[292,3,292,4],[304,5,304,6],[304,7,304,8],[415,7,415,8],[582,5,582,6],[582,7,582,8],[543,5,543,6],[543,7,543,8],[573,0,573,10],[578,5,578,6],[578,7,578,8],[579,5,579,6],[579,7,579,8],[543,3,543,4],[340,5,340,6],[460,7,460,8],[461,7,461,8],[460,5,460,6],[461,5,461,6],[523,7,523,8],[473,7,473,8],[520,7,520,8],[410,5,410,6],[334,3,334,4],[486,5,486,6],[486,7,486,8],[364,7,364,8],[358,3,358,4],[370,3,370,4],[370,5,370,6],[370,7,370,8],[376,3,376,4],[376,5,376,6],[358,5,358,6],[358,7,358,8],[73,7,73,9],[591,5,591,6],[591,7,591,8],[415,3,415,4],[519,7,519,8],[453,0,453,10],[523,5,523,6],[376,7,376,8],[473,5,473,6],[541,0,541,10],[532,5,532,6],[328,3,328,4],[410,7,410,8],[328,7,328,8],[410,3,410,4],[334,5,334,6],[334,7,334,8],[340,3,340,4],[484,0,484,10],[486,3,486,4],[520,5,520,6],[340,7,340,8],[364,3,364,4],[364,5,364,6]]}
[null,"Planning of a FC720 Cerberus station (one fire panel or terminal)"]
[]
[null,"Purpose:"]
[null,"With the project planning of the fire panel the load of the fire panel and the necessary batteries are verified. This results in the definite:"]
[null,"- type of station (fire panel / -terminal)"]
[null,"- type of batteries and power supply"]
[null,"Procedure:"]
[null,"1) Define type of station, dependent of # of detectors and PMI requirements"]
[null,"2) Fill out all additional sheets"]
[null,"3) Enter other loads from outputs and options"]
[null,"4) Enter required standby- and alarm time"]
[null,"5) Push \"Calculation Button\" for updating values"]
[null,"--> If the panel configuration is not valid \"Red/Orange Calculation Button\" check"]
[null,"… power supply and batteries, change with button if possible (depends on used station, power supply, …)"]
[null,"… that all panel status information is ok"]
[null,"--> With column \"Try other settings\" it's possible to check if actual config is possible with other housing"]
[null,"… result has no impact to general configuration"]
[null,"--> The panel configuration must be valid \"Green Calculation Button\" before continuing"]
[null,"Please consider:"]
[null,"It is not possible to check all interactions of all options with each other. Restrictions in the use of options together are noted in the document A6V10210362 \"Planning\" and A6V10210390 \"Installation\"."]
[]
[]
[null,"yellow fields","Must be filled in by the user"]
[null,"orange fields","Shows an input data error. These fields must be filled in by the user"]
[]
[null,"green fields","Calculated value, configuration valid. Field must not be changed by the user."]
[null,"red fields","Calculated value, configuration invalid. Field must not be changed by the user."]
[null,"light green fields","Calculated value, additional information for the user. Field must not be changed by the user."]
[]
["Panel selection"]
[null,"Help values"]
[]
[null,null,"Selection Panel Type",null,null,"Panel Information"]
[null,null,6,null,null,"Panel order number",null,"S54400-C31-A2"]
[null,null,"FT724",null,null,"Panel description",null,"International"]
[null,null,"Actual Station Type",null,null,"Main CPU",null,"FCM2027"]
[null,null,6,null,null,"PMI Button",null,"--"]
[null,null,"FT724",null,null,"Panel Periphery",null,"FTI2001"]
[null,null,null,null,null,"Panel Extra Equipment",null,"--"]
[null,null,"Selection Panel Variant",null,null,"Operation Add-on"]
[null,null,1,null,null,"Network&Communication PMI",null,"show"]
[null,null,"FT724-ZZ",null,null,"Network&Communication Add-on",null,"show"]
[null,null,null,null,null,"Card cages",null,"--"]
[null,null,null,null,null,"CC5 Button",null,"--"]
[null,null,null,null,null,"Extinguishing",null,"--"]
[null,null,null,null,null,"PS1: Panel Supply Equip..",null,0]
[null,null,"Panel variants",null,null,"PS1: Panels Housings",null,"eco"]
[null,null,"FT724-ZZ",null,null,"PS1: Max. fitting supply",null,70]
[null,null,"FT724-HZ",null,null,"PS1: Max. fitting battery",null,7]
[null,null,"--",null,null,"PS2: Panel Supply Equip..",null,0]
[null,null,"--",null,null,"PS2: Panels Housings",null,"--"]
[null,null,"--",null,null,"PS2: Max. fitting supply",null,0]
[null,null,"--",null,null,"PS2: Max. fitting battery",null,"--"]
[null,null,"--"]
[null,null,"--"]
[null,null,"--"]
[null,null,"--",null,null,"Fix I2C amount panel"]
[null,null,"--",null,null,"fix I2C devices panel",null,1]
[null,null,"--"]
[null,null,"--"]
[null,null,"--"]
[null,null,"--"]
[null,null,"--"]
[null,null,"--",null,null,"Card cage status information"]
[null,null,"--",null,null,"Amount Card Cage CPU",null,0]
[null,null,"--",null,null,"Amount CardCage2",null,0]
[null,null,"--",null,null,"Amount CardCage5",null,0]
[null,null,"--",null,null,"All CCx config ok",null,true]
[null,null,"--"]
[null,null,"--",null,null,"FDnet status information"]
[null,null,"--",null,null,"Amount of FDnet field devices",null,0]
[null,null,"--",null,null,"All FDnet config ok",null,true]
[null,null,"--",null,null,"Some FDnet calculation must be updated",null,false]
[]
[]
[]
[]
[null,"Panel selection"]
[]
[]
[null,"Panel characteristics:"]
[null,"Panel type:","FT724-ZZ"]
[null,"Variant:","International"]
[null,"Order number: ","S54400-C31-A2"]
[null,"PMI type:","FCM2027"]
[null,"Peripheral board:","FTI2001"]
[null,"Housing type:","eco"]
[null,"Supply type:","No power supply",0,"W"]
[null,"Max. fitting batteries:","FA2003-A1",7,"Ah"]
[null,"Max. fitting supply:","FP2015-A1",70,"W"]
[]
[]
[]
[]
[null,"Add / Remove FT20x0 Terminal"]
[]
[]
[]
[null,"Add / Remove Extinguishing Sectors"]
[]
[]
[]
[null,"Add / Remove Card cage 5"]
[]
[]
[]
["Field devices"]
[]
[null,"C-NET Module2",null,null,null,"quiescent current",null,"alarm current",null,"remarks",null,null,"Active",null,"Supply"]
[null,"Current consumption (at panel by 24V)",null,null,null,3.9E-2,"A",3.9E-2,"A","Values from \"C-NET_Module2\"",null,null,false,null,1]
[]
[null,"C-NET Module3",null,null,null,"quiescent current",null,"alarm current",null,"remarks",null,null,"Active",null,"Supply"]
[null,"Current consumption (at panel by 24V)",null,null,null,3.9E-2,"A",3.9E-2,"A","Values from \"C-NET_Module3\"",null,null,false,null,1]
[]
[]
[]
[]
[]
[]
[]
[]
[]
[]
[]
[null,"General Input Check Extinguishing",true]
[null,null,null,null,null,"quiescent power",null,"alarm power"]
[null,"Summarized power supply 1",null,null,null,0,"W",0,"W"]
[]
[]
[]
[]
["Outputs of peripheral board",null,null,null,null,null,null,null,null,null,null,null,"Active",null,"Supply"]
[null,null,null,null,null,null,null,null,null,null,null,null,false,null,1]
[null,"Sounder Lines",null,null,null,null,null,"alarm current",null,"remarks"]
[null,"Sounder line 1 (SOUND1)",null,null,null,null,null,0,"A",null,null,null,"Active",null,"Supply"]
[null,"Sounder line 2 (SOUND2)",null,null,null,null,null,0,"A",null,null,null,false,null,1]
[]
[null,"Alarm & Fault Outputs",null,null,null,"quiescent current",null,"alarm current",null,"remarks"]
[null,"Load on \"Output Alarm supervised\" (AL_OUT)",null,null,null,null,null,0,"A"]
[null,"Load on \"Output Fault supervised\" (FAU_OUT)",null,null,null,0.01,"A",0,"A"]
[]
[null,"External supply output 1 (VSYS_01)",null,null,null,"quiescent current",null,"alarm current",null,"remarks"]
[null,"External supply output 1 (VSYS_01)",null,null,null,0,"A",0,"A","Enter either all external loads at VSYS_01 pin in top row or single  values below (ext. supply, activated IO outputs, ...). Enter average values."]
[null,"Load on \"Configurable I/Os\" (I/Ox)",null,null,null,0,"A",0,"A"]
[null,"Load for connected Sounder Modules","FCA2005-A1",null,null,0,"A",0,"A"]
[null,"Load for connected FDCIO223","FDCIO223",null,null,0,"A",0,"A"]
[null,"Load for connected FT724 Terminals","FT724",null,null,0,"A",0,"A"]
[null,"Load for Scalance Ethernet Switch","X204-2 / S612",null,null,0,"A",0,"A"]
[]
[null,"External supply output 2 (VSYS_02)",null,null,null,"quiescent current",null,"alarm current",null,"remarks",null,null,"Active",null,"Supply"]
[null,"External supply output 2 (VSYS_02)",null,null,null,0,"A",0,"A","Enter either all external loads at VSYS_02 pin in top row or single values below (ext. supply, activated IO outputs, ...). Enter average values.",null,null,false,null,1]
[null,"Load on \"Configurable I/Os\" (I/Ox)",null,null,null,0,"A",0,"A"]
[null,"Load for connected Sounder Modules","FCA2005-A1",null,null,0,"A",0,"A"]
[null,"Load for connected FDCIO223","FDCIO223",null,null,0,"A",0,"A"]
[null,"Load for connected FT724 Terminals","FT724",null,null,0,"A",0,"A"]
[null,"Load for Scalance Ethernet Switch","X204-2 / S612",null,null,0,"A",0,"A"]
[]
[]
[]
[]
[]
[]
[]
[]
[]
[]
[]
[null,"General Input Check Extinguishing",true]
[null,null,null,null,null,"quiescent power",null,"alarm power"]
[null,"Summarized power supply 1",null,null,null,0,"W",0,"W"]
[]
[]
[]
[]
["Operation add-on",null,null,null,null,null,null,null,null,null,null,null,"Active",null,"Supply"]
[null,null,null,null,null,null,null,null,null,null,null,null,true,null,1]
[null,"Fire department periphery module",null,"Quantity",null,"quiescent power",null,"alarm power",null,"remarks"]
[null,"Fire department periphery module","FCI2001-D1",0,"pcs"]
[null,"FBF",null,null,null,0,null,0]
[null,"UeE",null,null,null,0,null,0]
[null,"FSD",null,null,null,0,null,0]
[null,"Kennleuchte",null,null,null,0,null,0]
[null,"FSE",null,null,null,0,null,0]
[null,"FAT",null,null,null,0,null,0]
[null,"OeA",null,null,null,0,null,0]
[]
[null,"Operation add-on",null,"Quantity",null,"quiescent power",null,"alarm power",null,"remarks"]
[null,"Operation add-on with 2x24 LED indicators","FCM7213-Y3",0,"pcs",0,"W",0,"W","Every 24-LED block not included in standard panel variant"]
[null,"Operation add-on with 4x24 LED indicators","FCM7214-Y3",0,"pcs",0,"W",0,"W","Every 24-LED block not included in standard panel variant"]
[null,"Operating add-on with 20-zone EVAC indicator","FCM7221-H3",0,"pcs",0,"W",0,"W","20-zone EVAC indicator add-on"]
[]
[]
[]
[]
[]
[]
[]
[]
[]
[]
[]
[null,"General Input Check Extinguishing",true]
[null,null,null,null,null,"quiescent power",null,"alarm power"]
[null,"Summarized power supply 1",null,null,null,0,"W",0,"W"]
[]
[]
[]
[]
["Networking & Communication PMI",null,null,null,null,null,null,null,null,null,null,null,"Active",null,"Supply"]
[null,null,null,null,null,null,null,null,null,null,null,null,true,null,1]
[null,"Networking",null,"Quantity",null,"quiescent power",null,"alarm power",null,"remarks",null,null,"Active",null,"Supply"]
[null,"Ethernet connection",null,0,"pcs",0,"W",0,"W","Only if used in operational mode of panel",null,null,true,null,1]
[null,"Networking module (SAFEDLINK)","FN2001-A1",0,"pcs",0,"W",0,"W"]
[]
[null,"Communication",null,"Quantity",null,"quiescent power",null,"alarm power",null,"remarks"]
[null,"RS232 module (isolated)","FCA2001-A1",0,"pcs",0,"W",0,"W"]
[null,"RS485 module (isolated)","FCA2002-A1 ",0,"pcs",0,"W",0,"W"]
[]
[]
[]
[]
[]
[]
[]
[]
[]
[]
[]
[]
[null,"General Input Check Extinguishing",true]
[null,null,null,null,null,"quiescent power",null,"alarm power"]
[null,"Summarized power supply 1",null,null,null,0,"W",0,"W"]
[]
[]
[]
[]
["Networking & Communication Add-on",null,null,null,null,null,null,null,null,null,null,null,"Active",null,"Supply"]
[null,null,null,null,null,null,null,null,null,null,null,null,true,null,1]
[]
[]
[null,"Networking",null,"Quantity",null,"quiescent power",null,"alarm power",null,"remarks"]
[null,"Ethernet switch (MM)","FN2008-A1",0,"pcs",0,"W",0,"W"]
[null,"Security module (firewall)","FN2009-A1",0,"pcs",0,"W",0,"W"]
[null,"Fiber optic cable network module (SM/MM)","FN2006/7-A1",0,"pcs",0,"W",0,"W"]
[null,"Ethernet switch (modular) - SM/MM","FN2012-A1",0,"pcs",0,"W",0,"W"]
[null,"Repeater (SAFEDLINK)","FN2002",0,"pcs",0,"W",0,"W"]
[null,"Interface module","DL485/13-xx-ST-SBT",0,"pcs",0,"W",0,"W"]
[]
[null,"Printer",null,"Quantity",null,"quiescent power",null,"alarm power",null,"remarks",null,null,"Active"]
[null,"Event printer","FTO2001-A1 ",0,"pcs",0,null,0,null,"If used: current= 50…100mA, depending on printing frequency.",null,null,false]
[null,null,null,null,null,null,null,null,null,"1 RS232 Module required additionally"]
[]
[null,"Detached-Options (supply from FS20 station)",null,"Quantity",null,"quiescent power",null,"alarm power",null,"remarks"]
[null,"Remote EVAC 20-zone","FCM2008-N1, 2xFTI2002-N1",0,"pcs",0,"W",0,"W","One RS485 Module required additionally"]
[null,"Mimic display driver EVAC 10-zone","FT2003-N1",0,"pcs",0,"W",0,"W","One RS485 Module required additionally"]
[]
[]
[]
[]
[]
[]
[]
[]
[]
[]
[null,"General Input Check Extinguishing",true]
[null,null,null,null,null,"quiescent power",null,"alarm power"]
[null,"Summarized power supply 1",null,null,null,0,"W",0,"W"]
[null,"Summarized power supply 2",null,null,null,0,"W",0,"W"]
[null,"Summarized power supply 3",null,null,null,0,"W",0,"W"]
[]
[]
["Extinguishing"]
[]
[]
[]
[]
[]
[]
[]
[]
[]
[]
[]
[]
[]
[]
[]
[null,"Chosen","Number","Active","Single"]
[null,"1 Extinguishing Card",1,false,0]
[null,null,null,null,"always supply1 with single sector"]
[]
[null,"Sector 1",null,"Quantity",null,"quiescent power",null,"extinguishing power",null,"remarks",null,null,"Active","Check","Supply","ModBus"]
[null,"Extinguishing card loads at Outputs","XCI2005-A1, FCA2046-A1",null,null,0,"A",0,"A","Actuator, Valves, Illum. Panels, Driver …. Max. 4A per card ",null,null,true,true,1,"module bus 1"]
[null,"Extinguishing terminal","XCM7202-Z3, XT2001-A2",1,"pcs",0.57600000000000007,"W",1.1040000000000001,"W","Min. 1, max. 6 Terminal"]
[null,"Total power consumption",null,"Supply",1,2.6880000000000002,"W",3.2160000000000002,"W","Total power consumption"]
[]
[]
[null,"Sector 2",null,"Quantity",null,"quiescent power",null,"extinguishing power",null,"remarks",null,null,"Active","Check","Supply","ModBus"]
[null,"Extinguishing card loads at Outputs (XCI2005-A1, FCA2046-A1)",null,null,null,0,"A",0,"A","Actuator, Valves, Illum. Panels, Driver …. Max. 4A per card ",null,null,false,true,1,"module bus 1"]
[null,"Extinguishing terminal (XCM2002-A2, XCM2003-A2, XT2001-A2)",null,1,"pcs",0,"W",0,"W","Min. 1, max. 6 Terminal"]
[null,"Total power consumption",null,"Supply",1,0,"W",0,"W","Total power consumption"]
[]
[]
[null,"Sector 3",null,"Quantity",null,"quiescent power",null,"extinguishing power",null,"remarks",null,null,"Active","Check","Supply","ModBus"]
[null,"Extinguishing card loads at Outputs (XCI2005-A1, FCA2046-A1)",null,null,null,0,"A",0,"A","Actuator, Valves, Illum. Panels, Driver …. Max. 4A per card ",null,null,false,true,1,"module bus 1"]
[null,"Extinguishing terminal (XCM2002-A2, XCM2003-A2, XT2001-A2)",null,1,"pcs",0,"W",0,"W","Min. 1, max. 6 Terminal"]
[null,"Total power consumption",null,"Supply",1,0,"W",0,"W","Total power consumption"]
[]
[]
[null,"Sector 4",null,"Quantity",null,"quiescent power",null,"extinguishing power",null,"remarks",null,null,"Active","Check","Supply","ModBus"]
[null,"Extinguishing card loads at Outputs (XCI2005-A1, FCA2046-A1)",null,null,null,0,"A",0,"A","Actuator, Valves, Illum. Panels, Driver …. Max. 4A per card ",null,null,false,true,1,"module bus 1"]
[null,"Extinguishing terminal (XCM2002-A2, XCM2003-A2, XT2001-A2)",null,1,"pcs",0,"W",0,"W","Min. 1, max. 6 Terminal"]
[null,"Total power consumption",null,"Supply",1,0,"W",0,"W","Total power consumption"]
[]
[]
[null,"Sector 5",null,"Quantity",null,"quiescent power",null,"extinguishing power",null,"remarks",null,null,"Active","Check","Supply","ModBus"]
[null,"Extinguishing card loads at Outputs (XCI2005-A1, FCA2046-A1)",null,null,null,0,"A",0,"A","Actuator, Valves, Illum. Panels, Driver …. Max. 4A per card ",null,null,false,true,1,"module bus 1"]
[null,"Extinguishing terminal (XCM2002-A2, XCM2003-A2, XT2001-A2)",null,1,"pcs",0,"W",0,"W","Min. 1, max. 6 Terminal"]
[null,"Total power consumption",null,"Supply",1,0,"W",0,"W","Total power consumption"]
[]
[]
[null,"Sector 6",null,"Quantity",null,"quiescent power",null,"extinguishing power",null,"remarks",null,null,"Active","Check","Supply","ModBus"]
[null,"Extinguishing card loads at Outputs (XCI2005-A1, FCA2046-A1)",null,null,null,0,"A",0,"A","Actuator, Valves, Illum. Panels, Driver …. Max. 4A per card ",null,null,false,true,1,"module bus 1"]
[null,"Extinguishing terminal (XCM2002-A2, XCM2003-A2, XT2001-A2)",null,1,"pcs",0,"W",0,"W","Min. 1, max. 6 Terminal"]
[null,"Total power consumption",null,"Supply",1,0,"W",0,"W","Total power consumption"]
[]
[]
[null,"Sector 7",null,"Quantity",null,"quiescent power",null,"extinguishing power",null,"remarks",null,null,"Active","Check","Supply","ModBus"]
[null,"Extinguishing card loads at Outputs (XCI2005-A1, FCA2046-A1)",null,null,null,0,"A",0,"A","Actuator, Valves, Illum. Panels, Driver …. Max. 4A per card ",null,null,false,true,1,"module bus 1"]
[null,"Extinguishing terminal (XCM2002-A2, XCM2003-A2, XT2001-A2)",null,1,"pcs",0,"W",0,"W","Min. 1, max. 6 Terminal"]
[null,"Total power consumption",null,"Supply",1,0,"W",0,"W","Total power consumption"]
[]
[]
[null,"Sector 8",null,"Quantity",null,"quiescent power",null,"extinguishing power",null,"remarks",null,null,"Active","Check","Supply","ModBus"]
[null,"Extinguishing card loads at Outputs (XCI2005-A1, FCA2046-A1)",null,null,null,0,"A",0,"A","Actuator, Valves, Illum. Panels, Driver …. Max. 4A per card ",null,null,false,true,1,"module bus 1"]
[null,"Extinguishing terminal (XCM2002-A2, XCM2003-A2, XT2001-A2)",null,1,"pcs",0,"W",0,"W","Min. 1, max. 6 Terminal"]
[null,"Total power consumption",null,"Supply",1,0,"W",0,"W","Total power consumption"]
[]
[]
[null,"Sector 9",null,"Quantity",null,"quiescent power",null,"extinguishing power",null,"remarks",null,null,"Active","Check","Supply","ModBus"]
[null,"Extinguishing card loads at Outputs (XCI2005-A1, FCA2046-A1)",null,null,null,0,"A",0,"A","Actuator, Valves, Illum. Panels, Driver …. Max. 4A per card ",null,null,false,true,2,"module bus 2"]
[null,"Extinguishing terminal (XCM2002-A2, XCM2003-A2, XT2001-A2)",null,1,"pcs",0,"W",0,"W","Min. 1, max. 6 Terminal"]
[null,"Power supply 1, only HCS12 is powered",null,"Supply",1,0,"W",0,"W","Total power consumption"]
[null,"Power supply 2, total",null,"Supply",2,null,"W",null,"W","Total power consumption"]
[]
[null,"Sector 10",null,"Quantity",null,"quiescent power",null,"extinguishing power",null,"remarks",null,null,"Active","Check","Supply","ModBus"]
[null,"Extinguishing card loads at Outputs (XCI2005-A1, FCA2046-A1)",null,null,null,0,"A",0,"A","Actuator, Valves, Illum. Panels, Driver …. Max. 4A per card ",null,null,false,true,2,"module bus 2"]
[null,"Extinguishing terminal (XCM2002-A2, XCM2003-A2, XT2001-A2)",null,1,"pcs",0,"W",0,"W","Min. 1, max. 6 Terminal"]
[null,"Power supply 1, only HCS12 is powered",null,"Supply",1,0,"W",0,"W","Total power consumption"]
[null,"Power supply 2, total",null,"Supply",2,null,"W",null,"W","Total power consumption"]
[]
[null,"Sector 11",null,"Quantity",null,"quiescent power",null,"extinguishing power",null,"remarks",null,null,"Active","Check","Supply","ModBus"]
[null,"Extinguishing card loads at Outputs (XCI2005-A1, FCA2046-A1)",null,null,null,0,"A",0,"A","Actuator, Valves, Illum. Panels, Driver …. Max. 4A per card ",null,null,false,true,2,"module bus 2"]
[null,"Extinguishing terminal (XCM2002-A2, XCM2003-A2, XT2001-A2)",null,1,"pcs",0,"W",0,"W","Min. 1, max. 6 Terminal"]
[null,"Power supply 1, only HCS12 is powered",null,"Supply",1,0,"W",0,"W","Total power consumption"]
[null,"Power supply 2, total",null,"Supply",2,null,"W",null,"W","Total power consumption"]
[]
[null,"Sector 12",null,"Quantity",null,"quiescent power",null,"extinguishing power",null,"remarks",null,null,"Active","Check","Supply","ModBus"]
[null,"Extinguishing card loads at Outputs (XCI2005-A1, FCA2046-A1)",null,null,null,0,"A",0,"A","Actuator, Valves, Illum. Panels, Driver …. Max. 4A per card ",null,null,false,true,2,"module bus 2"]
[null,"Extinguishing terminal (XCM2002-A2, XCM2003-A2, XT2001-A2)",null,1,"pcs",0,"W",0,"W","Min. 1, max. 6 Terminal"]
[null,"Power supply 1, only HCS12 is powered",null,"Supply",1,0,"W",0,"W","Total power consumption"]
[null,"Power supply 2, total",null,"Supply",2,null,"W",null,"W","Total power consumption"]
[]
[null,"Sector 13",null,"Quantity",null,"quiescent power",null,"extinguishing power",null,"remarks",null,null,"Active","Check","Supply","ModBus"]
[null,"Extinguishing card loads at Outputs (XCI2005-A1, FCA2046-A1)",null,null,null,0,"A",0,"A","Actuator, Valves, Illum. Panels, Driver …. Max. 4A per card ",null,null,false,true,2,"module bus 2"]
[null,"Extinguishing terminal (XCM2002-A2, XCM2003-A2, XT2001-A2)",null,1,"pcs",0,"W",0,"W","Min. 1, max. 6 Terminal"]
[null,"Power supply 1, only HCS12 is powered",null,"Supply",1,0,"W",0,"W","Total power consumption"]
[null,"Power supply 2, total",null,"Supply",2,null,"W",null,"W","Total power consumption"]
[]
[null,"Sector 14",null,"Quantity",null,"quiescent power",null,"extinguishing power",null,"remarks",null,null,"Active","Check","Supply","ModBus"]
[null,"Extinguishing card loads at Outputs (XCI2005-A1, FCA2046-A1)",null,null,null,0,"A",0,"A","Actuator, Valves, Illum. Panels, Driver …. Max. 4A per card ",null,null,false,true,2,"module bus 2"]
[null,"Extinguishing terminal (XCM2002-A2, XCM2003-A2, XT2001-A2)",null,1,"pcs",0,"W",0,"W","Min. 1, max. 6 Terminal"]
[null,"Power supply 1, only HCS12 is powered",null,"Supply",1,0,"W",0,"W","Total power consumption"]
[null,"Power supply 2, total",null,"Supply",2,null,"W",null,"W","Total power consumption"]
[]
[null,"Sector 15",null,"Quantity",null,"quiescent power",null,"extinguishing power",null,"remarks",null,null,"Active","Check","Supply","ModBus"]
[null,"Extinguishing card loads at Outputs (XCI2005-A1, FCA2046-A1)",null,null,null,0,"A",0,"A","Actuator, Valves, Illum. Panels, Driver …. Max. 4A per card ",null,null,false,true,2,"module bus 2"]
[null,"Extinguishing terminal (XCM2002-A2, XCM2003-A2, XT2001-A2)",null,1,"pcs",0,"W",0,"W","Min. 1, max. 6 Terminal"]
[null,"Power supply 1, only HCS12 is powered",null,"Supply",1,0,"W",0,"W","Total power consumption"]
[null,"Power supply 2, total",null,"Supply",2,null,"W",null,"W","Total power consumption"]
[]
[null,"Sector 16",null,"Quantity",null,"quiescent power",null,"extinguishing power",null,"remarks",null,null,"Active","Check","Supply","ModBus"]
[null,"Extinguishing card loads at Outputs (XCI2005-A1, FCA2046-A1)",null,null,null,0,"A",0,"A","Actuator, Valves, Illum. Panels, Driver …. Max. 4A per card ",null,null,false,true,2,"module bus 2"]
[null,"Extinguishing terminal (XCM2002-A2, XCM2003-A2, XT2001-A2)",null,1,"pcs",0,"W",0,"W","Min. 1, max. 6 Terminal"]
[null,"Power supply 1, only HCS12 is powered",null,"Supply",1,0,"W",0,"W","Total power consumption"]
[null,"Power supply 2, total",null,"Supply",2,null,"W",null,"W","Total power consumption"]
[]
[]
[null,"General Input Check Extinguishing",true]
[null,null,null,null,null,"quiescent power",null,"alarm power"]
[null,"Summarized power supply 1",null,null,null,0,"W",0,"W"]
[null,"Summarized power supply 2",null,null,null,0,"W",0,"W"]
[null,"Summarized power supply 3",null,null,null,0,"W",0,"W"]
[]
[null,"Module bus 1 devices",0,"pcs"]
[null,"Module bus 2 devices",0,"pcs"]
[]
[]
[]
[]
[]
[]
[]
[]
[]
[]
[]
["Panel",null,null,null,null,null,null,null,null,null,null,null,"Active","AddOpUnit"]
[null,null,null,null,null,null,null,null,null,null,null,null,true,false]
[null,"Own panel consumption",null,null,null,"quiescent power",null,"alarm power",null,"remarks"]
[null,"Panel",null,null,null,2.4000000000000004,"W",3.6000000000000005,"W"]
[]
["Supply 1 - Power consumption & Supply check & Battery check",null,null,null,null,null,null,null,null,null,null,null,"Active","Check"]
[null,null,null,null,null,null,null,null,null,null,null,null,true,true]
[null,"Power calculation",null,null,null,"quiescent power",null,"alarm power",null,"remarks"]
[null,"Panel",null,null,null,2.4000000000000004,"W",3.6000000000000005,"W"]
[]
[null,"Field devices",null,null,null,0,"W",0,"W"]
[]
[null,"Outputs peripheral board",null,null,null,0,"W",0,"W"]
[]
[null,"Operation Add-on",null,null,null,0,"W",0,"W"]
[]
[null,"Networking & Communication PMI",null,null,null,0,"W",0,"W"]
[]
[null,"Card cage CPU",null,null,null,0,"W",0,"W"]
[]
[null,"Networking & Communication Add-on",null,null,null,0,"W",0,"W"]
[]
[null,"Extinguishing",null,null,null,0,"W",0,"W"]
[]
[null,"Card cage 1",null,null,null,0,"W",0,"W"]
[null,"Card cage 2",null,null,null,0,"W",0,"W"]
[null,"Card cage 3",null,null,null,0,"W",0,"W"]
[null,"Card cage 4",null,null,null,0,"W",0,"W"]
[null,"Card cage 5",null,null,null,0,"W",0,"W"]
[null,"Card cage 6",null,null,null,0,"W",0,"W"]
[null,"Card cage 7",null,null,null,0,"W",0,"W"]
[null,"Card cage 8",null,null,null,0,"W",0,"W"]
[]
[null,"Additional Power Consumer (Power at 24V)",null,null,null,0,"W",0,"W","e.g. ASD"]
[null,"Additional Power Consumer (Power at 24V)",null,null,null,0,"W",0,"W","e.g. addtional power consumer"]
[null,"Additional Power Consumer (Power at 24V)",null,null,null,0,"W",0,"W","e.g. FT724"]
[]
[]
[null,"Total power consumption with chosen options",null,null,null,2.4000000000000004,"W",3.6000000000000005,"W","Powered by power supply or external supply"]
[]
[]
[]
[]
[]
[]
["Supply & Battery Check",null,null,null,null,null,null,null,null,null,null,null,"Active","Check"]
[null,null,null,null,null,null,null,null,null,null,null,null,false,true]
[null,"Battery required standby-time and capacity"]
[null,"Required standby-time",null,null,null,30,"h"]
[null,"Required alarm-time (after standby)",null,null,null,0.5,"h"]
[null,"Required batteries",null,null,null,5.0970000000000004,"Ah"]
[]
[null,"Supply and battery calculation",null,null,null,"Chosen Panel",null,"Try other settings",null,null,null,null,null,"ChPSos"]
[null,"Housing",null,null,null,"eco",null,"eco",null,"If the “Choosen Panel” does not fit the configuration, it’s possible to check with „Try other settings“ other cases, supplies and batteries.",null,null,null,false]
[null,"Max. fitting power supply into housing",null,null,null,70,"W",70,"W"]
[null,"Max. fitting battery into housing",null,null,null,7,"Ah",7,"Ah",null,null,null,"ChPScp","ChPSos"]
[null,"Power supply type (does not change if not possible due to battery)",null,null,null,"FP2015-A1",null,"FP2015-A1",null,null,null,null,false,false]
[null,"Nominal load power supply",null,null,null,70,"W",70,"W"]
[null,"Max. possible load power supply",null,null,null,60,"W",60,"W"]
[null,"Required load from configuration",null,null,null,null,6.1776000000000009,"W"]
[null,"Min. battery (depend on power supply and case)",null,null,null,0,"Ah",7,"Ah"]
[null,"Max. battery (depend on power supply and case)",null,null,null,0,"Ah",7,"Ah"]
[null,"Chosen battery",null,null,null,0,"Ah",null,"Ah"]
[null,"Max. possible charge power supply",null,null,null,60,"W",60,"W"]
[null,"Required power charge configuration",null,null,null,14.015999999999998,"W",5.6160000000000005,"W"]
[null,"Battery, Power supply and case configuration",null,null,null,"Power&Battery ok",null,"Power&Battery ok"]
[]
[]
[]
[null,"General Input Check Extinguishing",true]
[]
[]
[]
[]
[]
[]
["Supply 2 - Power consumption & Supply check & Battery check",null,null,null,null,null,null,null,null,null,null,null,"Active","Check"]
[null,null,null,null,null,null,null,null,null,null,null,null,false,true]
[null,"Power calculation",null,null,null,"quiescent power",null,"alarm power",null,"remarks"]
[]
[null,"Networking & Communication Add-on",null,null,null,0,"W",0,"W"]
[]
[null,"Extinguishing",null,null,null,0,"W",0,"W"]
[]
[null,"Card cage 1",null,null,null,0,"W",0,"W"]
[null,"Card cage 2",null,null,null,0,"W",0,"W"]
[null,"Card cage 3",null,null,null,0,"W",0,"W"]
[null,"Card cage 4",null,null,null,0,"W",0,"W"]
[null,"Card cage 5",null,null,null,0,"W",0,"W"]
[null,"Card cage 6",null,null,null,0,"W",0,"W"]
[null,"Card cage 7",null,null,null,0,"W",0,"W"]
[null,"Card cage 8",null,null,null,0,"W",0,"W"]
[]
[]
[null,"Additional Power Consumer (Power at 24V)",null,null,null,0,"W",0,"W","e.g. ASD"]
[null,"Additional Power Consumer (Power at 24V)",null,null,null,0,"W",0,"W","e.g. addtional power consumer"]
[null,"Additional Power Consumer (Power at 24V)",null,null,null,0,"W",0,"W","e.g. FT724"]
[]
[]
[null,"Total power consumption with chosen options",null,null,null,0,"W",0,"W","Powered by power supply or external supply"]
[]
[]
[]
[]
[]
[]
["Additional Supply 2 & Battery Check",null,null,null,null,null,null,null,null,null,null,null,"Active"]
[null,null,null,null,null,null,null,null,null,null,null,null,false]
[null,"Required capacity"]
[null,"Required batteries",null,null,null,null,"Ah"]
[]
[null,"Supply and battery calculation",null,null,null,"Chosen Panel",null,"Try other settings",null,null,null,null,null,"ChPSos"]
[null,"Housing",null,null,null,null,null,null,null,null,null,null,null,false]
[null,"Max. fitting power supply into housing",null,null,null,null,"W",null,"W"]
[null,"Max. fitting battery into housing",null,null,null,null,"Ah",null,"Ah",null,null,null,"ChPScp","ChPSos"]
[null,"Power supply type (does not change if not possible due to battery)",null,null,null,null,null,null,null,null,null,null,false,false]
[null,"Nominal load power supply",null,null,null,null,"W",null,"W"]
[null,"Max. possible load power supply",null,null,null,null,"W",null,"W"]
[null,"Required load from configuration",null,null,null,null,null,"W"]
[null,"Min. battery (depend on power supply and case)",null,null,null,0,"Ah",null,"Ah"]
[null,"Max. battery (depend on power supply and case)",null,null,null,0,"Ah",null,"Ah"]
[null,"Chosen battery",null,null,null,0,"Ah",null,"Ah"]
[null,"Max. possible charge power supply",null,null,null,null,"W",null,"W"]
[null,"Required power charge configuration",null,null,null,null,"W",null,"W"]
[null,"Battery, Power supply and case configuration",null,null,null,"Power&Battery ok"]
[]
[]
[]
[null,"General Input Check Extinguishing",true]
[]
[]
[]
[]
["Supply 3 - Power consumption & Supply check & Battery check",null,null,null,null,null,null,null,null,null,null,null,"Active","Check"]
[null,null,null,null,null,null,null,null,null,null,null,null,false,true]
[null,"Power calculation",null,null,null,"quiescent power",null,"alarm power",null,"remarks"]
[]
[null,"Networking & Communication Add-on",null,null,null,null,"W"]
[]
[null,"Extinguishing",null,null,null,null,"W",null,"W"]
[]
[null,"Card cage 1",null,null,null,0,"W",0,"W"]
[null,"Card cage 2",null,null,null,0,"W",0,"W"]
[null,"Card cage 3",null,null,null,0,"W",0,"W"]
[null,"Card cage 4",null,null,null,0,"W",0,"W"]
[null,"Card cage 5",null,null,null,0,"W",0,"W"]
[null,"Card cage 6",null,null,null,0,"W",0,"W"]
[null,"Card cage 7",null,null,null,0,"W",0,"W"]
[null,"Card cage 8",null,null,null,null,"W",null,"W"]
[]
[]
[]
[]
[null,"Additional Power Consumer (Power at 24V)",null,null,null,0,"W",0,"W","e.g. ASD"]
[null,"Additional Power Consumer (Power at 24V)",null,null,null,0,"W",0,"W","e.g. addtional power consumer"]
[null,"Additional Power Consumer (Power at 24V)",null,null,null,0,"W",0,"W","e.g. FT724"]
[]
[]
[null,"Total power consumption with chosen options",null,null,null,0,"W",0,"W","Powered by power supply or external supply"]
[]
[]
[]
[]
[]
[]
["Additional Supply 3 & Battery Check",null,null,null,null,null,null,null,null,null,null,null,"Active","Check"]
[null,null,null,null,null,null,null,null,null,null,null,null,false,true]
[null,"Required capacity"]
[null,"Required batteries",null,null,null,null,"Ah"]
[]
[null,"Supply and battery calculation",null,null,null,"Chosen Panel",null,"Try other settings",null,null,null,null,null,"ChPSos"]
[null,"Housing",null,null,null,null,null,null,null,null,null,null,null,false]
[null,"Max. fitting power supply into housing","Press Button to refresh calculation",null,null,null,"W",null,"W"]
[null,"Max. fitting battery into housing",null,null,null,null,"Ah",null,"Ah",null,null,null,"ChPScp","ChPSos"]
[null,"Power supply type (does not change if not possible due to battery)",null,null,null,null,null,null,null,null,null,null,false,false]
[null,"Nominal load power supply",null,null,null,null,"W",null,"W"]
[null,"Max. possible load power supply",null,null,null,null,"W",null,"W"]
[null,"Required load from configuration",null,null,null,null,null,"W"]
[null,"Min. battery (depend on power supply and case)",null,null,null,null,"Ah",null,"Ah"]
[null,"Max. battery (depend on power supply and case)",null,null,null,null,"Ah",null,"Ah"]
[null,"Chosen battery",null,null,null,null,"Ah",null,"Ah"]
[null,"Max. possible charge power supply",null,null,null,null,"W",null,"W"]
[null,"Required power charge configuration",null,null,null,null,"W",null,"W"]
[null,"Battery, Power supply and case configuration"]
[]
[]
[]
[null,"General Input Check Extinguishing",true]
[]
[]
[]
[]
["Panel status information"]
[]
[null,"Panel status information"]
[null,"Amount of FDnet field devices:",0,"pcs"]
[null,"Module bus 1 devices (line and exting. cards):",0,"pcs"]
[null,"Module bus 2 devices (line and exting. cards):",0,"pcs"]
[null,"Periphery bus devices:",1,"pcs"]
[null,"Total Status information:"]

{"sheet":"FS20_Constants","index":4,"n_rows":406,"n_cols":5,"rows_kept":406,"cut":false,"hidden":true,"merged":[]}
["General FS20 characteristic values"]
[]
[]
["General"]
["Voltage for degrade time calculation","Gen_24V",24,"V"]
["Max. amount of I2C devices","Gen_I2C_MaxDevice",16]
["Max. possible amount of card cage 2","Gen_MaxAmountCC2",5]
["Max. possible amount of card cage 5","Gen_MaxAmountCC5",7]
["Max. possible extinguishing cards per module bus","Gen_MaxExtModBus",8]
["Max. possible card cage5 with ext. on module bus 1","Gen_MaxCC5ModuleBus1_WithExt",2]
["Max. possible linecards with ext. on module bus 1","Gen_MaxCardModuleBus1_WithExt",12]
["Max. possible card cage5 w/o ext. on module bus 1","Gen_MaxCC5ModuleBus1_WithOutExt",4]
["Max. possible linecards w/o ext. on module bus 1","Gen_MaxCardModuleBus1_WithOutExt",22]
["Max. possible card cage5 with ext. on module bus 2","Gen_MaxCC5ModuleBus2_WithExt",2]
["Max. possible linecards with ext. on module bus 2","Gen_MaxCardModuleBus2_WithExt",10]
["Max. possible card cage5 w/o ext. on module bus 2","Gen_MaxCC5ModuleBus2_WithOutExt",4]
["Max. possible linecards w/o ext. on module bus 2","Gen_MaxCardModuleBus2_WithOutExt",20]
["Security factor for battery calculation","Gen_LoadSecurityFactor",1.1000000000000001]
["Max. power for add power consumer","Gen_MaxPowerAddConsumer",100,"W"]
["Max. battery calculation time","Gen_MaxBattCalcTime",500,"h"]
[]
[]
[]
["Panel"]
["Panel FCM2027 quiet current","Panel_FCM2027Quiet",0.09,"A","Quiet current @24V"]
["Panel FCM2027 alarm current","Panel_FCM2027Alarm",0.14000000000000001,"A","Alarm current @24V"]
[]
["Panel FT2080 quiet current","Panel_FT2080Quiet",0.32500000000000001,"A","Quiet current @24V"]
["Panel FT2080 alarm current","Panel_FT2080Alarm",0.57999999999999996,"A","Alarm current @24V"]
[]
["Panel FCI2002 quiet current (w/o FDnet)","Panel_FCI2002Quiet",2.7E-2,"A","Quiet current @24V"]
["Panel FCI2002 alarm current (w/o FDnet)","Panel_FCI2002Alarm",5.5E-2,"A","Alarm current @24V"]
["Panel FCI2004 quiet current (w/o FDnet)","Panel_FCI2004Quiet",5.2999999999999999E-2,"A","Quiet current @24V"]
["Panel FCI2004 alarm current (w/o FDnet)","Panel_FCI2004Alarm",0.10299999999999999,"A","Alarm current @24V"]
["Panel FTI2001 current","Panel_FTI2001",0.01,"A","Quiet/Alarm current @24V"]
[]
["Panel FTO2004 (FBA) quiet current","Panel_FTO2004Quiet",1.4999999999999999E-2,"A","Quiet current @24V"]
["Panel FTO2004 (FBA) alarm current","Panel_FTO2004Alarm",0.03,"A","Alarm current @24V"]
["Panel FTO2008 (LED) quiet current","Panel_FTO2008Quiet",5.0000000000000001E-3,"A","Quiet current @24V"]
["Panel FTO2008 (LED) alarm current","Panel_FTO2008Alarm",5.2999999999999999E-2,"A","Alarm current @24V (48 LED FTO2008 or ~48 LED FTO2002)"]
["Panel FTO2007 (EVAC-NL) quiet current","Panel_FTO2007Quiet",6.0000000000000001E-3,"A","Quiet current @24V"]
["Panel FTO2007 (EVAC-NL) alarm current","Panel_FTO2007Alarm",0.03,"A","Alarm current @24V"]
[]
["Panel FCA2006-A1 connection Module current","Panel_ConnModule",1.9E-2,"A","Quiet/Alarm current @24V"]
[]
[]
["Output peripheral"]
["Output peripheral max. current per Sounder Line","OutPeripheral_MaxSounder",1,"A"]
["Output peripheral max. current per Supply Output","OutPeripheral_MaxSupply",1,"A"]
["Output peripheral max. current per Fault","OutPeripheral_MaxFault",0.3,"A"]
[]
[]
["Operation Add-on"]
["Operation Add-on FCI2001 quiet current","OpAddOnFCI2001Quiet",5.8000000000000003E-2,"A","Quiet current @24V"]
["Operation Add-on FCI2001 alarm current","OpAddOnFCI2001Alarm",6.2E-2,"A","Alarm current @24V"]
["Operation Add-on FCI2001 max current","OpAddOnFCI2001Max",1,"A"]
["Operation Add-on FCM2006 quiet current","OpAddOnFCM2006Quiet",{"$f":"2*C39","v":0.01},"A","Quiet current @24V / FCM7213-Y3"]
["Operation Add-on FCM2006 alarm current","OpAddOnFCM2006Alarm",{"$f":"2*C40","v":0.106},"A","Alarm current @24V / FCM7213-Y3"]
["Operation Add-on FCM2007 quiet current","OpAddOnFCM2007Quiet",{"$f":"4*C39","v":0.02},"A","Quiet current @24V / FCM7214-Y3"]
["Operation Add-on FCM2007 alarm current","OpAddOnFCM2007Alarm",{"$f":"4*C40","v":0.21199999999999999},"A","Alarm current @24V / FCM7214-Y3"]
["Operation Add-on FCM2008 (EVAC-NL) quiet current","OpAddOnFCM2008Quiet",{"$f":"2*C41","v":1.2E-2},"A","Quiet current @24V / FCM7221-H3"]
["Operation Add-on FCM2008 (EVAC-NL) alarm current","OpAddOnFCM2008Alarm",{"$f":"2*C42","v":0.06},"A","Alarm current @24V / FCM7221-H3"]
["Operation Add-on FTI2002-N1 (EVAC-NL) con. Board","OpAddOnFTI2002",2.4E-2,"A","Current @24V"]
[]
[]
["Network&Communication PMI"]
["Network&Comm Ethernet current","NetCommPMI_Ethernet",1.4999999999999999E-2,"A","Quiet/Alarm current @24V"]
["Network&Comm FN2001 current","NetCommPMI_FN2001",2.1999999999999999E-2,"A","Quiet/Alarm current @24V"]
["Network&Comm FCA2001 current","NetCommPMI_FCA2001",1.0999999999999999E-2,"A","Quiet/Alarm current @24V (0.065@3V3 with 80% efficency)"]
["Network&Comm FCA2002 current","NetCommPMI_FCA2002",1.0999999999999999E-2,"A","Quiet/Alarm current @24V"]
["Network&Comm max serial","NetCommPMI_MaxSerial",2]
[]
[]
["Network&Communication Add-on"]
["Network&Comm Add-on FN2008 current","NetCommAddOn_FN2008",0.16300000000000001,"A","Quiet/Alarm current @24V"]
["Network&Comm Add-on FN2009 current","NetCommAddOn_FN2009",0.188,"A","Quiet/Alarm current @24V"]
["Network&Comm Add-on FN2006 current","NetCommAddOn_FN2006",0.13,"A","Quiet/Alarm current @24V"]
["Network&Comm Add-on FN2012 current","NetCommAddOn_FN2012",0.192,"A","Quiet/Alarm current @24V"]
["Network&Comm Add-on FN2002 current","NetCommAddOn_FN2002",4.4999999999999998E-2,"A","Quiet/Alarm current @24V"]
["Network&Comm Add-on DL485 current","NetCommAddOn_DL485",6.2E-2,"A","Quiet/Alarm current @24V"]
["Network&Comm Add-on Event Printer quiet current","NetCommAddOn_EventPrinterQuiet",0.05,"A","Quiet current @24V"]
["Network&Comm Add-on Event Printer alarm current","NetCommAddOn_EventPrinterAlarm",0.06,"A","Alarm current @24V"]
["Network&Comm Add-on Remote EVAC quiet current","NetCommAddOn_RemoteEVACQuiet",{"$f":"OpAddOnFTI2002+OpAddOnFCM2008Quiet","v":3.6000000000000004E-2},"A","Quiet current @24V"]
["Network&Comm Add-on Remote EVAC alarm current","NetCommAddOn_RemoteEVACAlarm",{"$f":"OpAddOnFTI2002+OpAddOnFCM2008Alarm","v":8.3999999999999991E-2},"A","Alarm current @24V"]
["Network&Comm Add-on FT2003 quiet current","NetCommAddOn_FT2003Quiet",1.7999999999999999E-2,"A","Quiet current @24V"]
["Network&Comm Add-on FT2003 alarm current","NetCommAddOn_FT2003Alarm",8.5000000000000006E-2,"A","Alarm current @24V"]
["Network&Comm Add-on max amount","NetCommAddOn_MaxAmout",5,"pcs"]
[]
[]
["Extinguishing"]
["Extinguishing card XCI2005-A1 HCS12 quiet current consumption","ExtCard_HCS12_Quiet",2.1999999999999999E-2,"A","Quiet current terminal @24V"]
["Extinguishing card XCI2005-A1 MSP430 quiet current consumption","ExtCard_MSP430_Quiet",6.6000000000000003E-2,"A","Quiet current terminal @24V"]
["Extinguishing card XCI2005-A1 max. Current","ExtCard_MaxCurrent",4,"A"]
["Extinguishing card XCI2005-A1 min. amount of Extinguishing Terminal","ExtCard_MinAmountTerminal",1,"pcs"]
["Extinguishing card XCI2005-A1 max. amount of Extinguishing Terminal","ExtCard_MaxAmountTerminal",6,"pcs"]
["Extinguishing terminal XTO2001-A1 quiet current 24V","ExtTerminal_Quiet_Int_24V",2.4E-2,"A","Quiet current terminal @24V (1*green, 1*white)"]
["Extinguishing terminal XTO2001-A1 extinguishing current 24V","ExtTerminal_Ext_Int_24V",4.5999999999999999E-2,"A","Extinguishing current terminal @24V (Counter, Led's and Buzzer)"]
["Extinguishing terminal XTO2001-A1 quiet current 12V","ExtTerminal_Quiet_Ext_12V",3.7999999999999999E-2,"A","Quiet current terminal @12V (1*green, 1*white)"]
["Extinguishing terminal XTO2001-A1 extinguishing current 12V","ExtTerminal_Ext_Ext_12V",8.2000000000000003E-2,"A","Extinguishing current terminal @12V (Counter, Led's and Buzzer)"]
[]
[]
[]
[]
[]
[]
[]
[]
[]
[]
[]
[]
[]
[]
[]
[]
[]
[]
[]
[]
[]
[]
[]
[]
[]
[]
[]
[]
[]
[]
[]
[]
[]
[]
[]
[]
[]
[]
[]
[]
[]
[]
[]
[]
[]
[]
[]
[]
[]
[]
[]
[]
[]
[]
[]
[]
[]
[]
[]
[]
[]
[]
[]
[]
[]
[]
[]
[]
[]
[]
[]
[]
[]
[]
[]
[]
[]
[]
[]
[]
[]
[]
[]
[]
[]
[]
[]
[]
[]
[]
[]
[]
[]
[]
[]
[]
[]
[]
[]
[]
[]
[]
[]
[]
[]
[]
[]
[]
[]
[]
[]
[]
[]
[]
[]
[]
[]
[]
[]
[]
[]
[]
[]
[]
[]
[]
[]
[]
[]
[]
[]
[]
[]
[]
[]
[]
[]
[]
[]
[]
[]
[]
[]
[]
[]
[]
[]
[]
[]
[]
[]
[]
[]
[]
[]
[]
[]
[]
[]
[]
[]
[]
[]
[]
[]
[]
[]
[]
[]
[]
[]
[]
[]
[]
[]
[]
[]
[]
[]
[]
[]
[]
[]
[]
[]
[]
[]
[]
[]
[]
[]
[]
[]
[]
[]
[]
[]
[]
[]
[]
[]
[]
[]
[]
[]
[]
[]
[]
[]
[]
[]
[]
[]
[]
[]
[]
[]
[]
[]
[]
[]
[]
[]
[]
[]
[]
[]
[]
[]
[]
[]
[]
[]
[]
[]
[]
[]
[]
[]
[]
[]
[]
[]
[]
[]
[]
[]
[]
[]
[]
[]
[]
[]
[]
[]
[]
[]
[]
[]
[]
[]
[]
[]
[]
[]
[]
[]
[]
[]
[]
[]
[]
[]
[]
[]
[]
[]
[]
[]
[]
[]
[]
[]
[]
[]
[]
[]
[]
[]
[]
[]
[]
[]
[]
[]
[]
[]
[]
[]
[]
[]
[]
[]
[]
[]
[null,null,0]
[null,null,0]

{"sheet":"Panel_values","index":5,"n_rows":524,"n_cols":26,"rows_kept":524,"cut":false,"hidden":true,"merged":[]}
[null,"Variants"]
["Panel Types",1,2,3,4,5,6,7,8,9,10,11,12,13,14,15,16,17,18,19,20,21,22,23,24,25]
["FC721 = 1","FC721-ZZ","FC721-YZ","FC721-HZ","--","--","--","--","--","--","--","--","--","--","--","--","--","--","--","--","--","--","--","--","--","--"]
["FC722 = 2","FC722-ZZ","FC722-YZ","FC722-ZA","FC722-ZE","FC722-HA","FC722-XZ","FC722-XA","--","--","--","--","--","--","--","--","--","--","--","--","--","--","--","--","--","--"]
["FC723 = 3","FC723-ZA","--","--","--","--","--","--","--","--","--","--","--","--","--","--","--","--","--","--","--","--","--","--","--","--"]
["FC724 = 4","FC724-ZA","FC724-ZE","FC724-HA","FC724-XA","--","--","--","--","--","--","--","--","--","--","--","--","--","--","--","--","--","--","--","--","--"]
["FC726 = 5","FC726-ZA","FC726-XA","--","--","--","--","--","--","--","--","--","--","--","--","--","--","--","--","--","--","--","--","--","--","--"]
["FT724 = 6","FT724-ZZ","FT724-HZ","--","--","--","--","--","--","--","--","--","--","--","--","--","--","--","--","--","--","--","--","--","--","--"]
["FC728 = 7"]
["FG722 = 8"]
["FT728= 9"]
[""]
[""]
[""]
[""]
[""]
[""]
[""]
[""]
[""]
[]
[null,{"$f":"B$1","v":"Variants"}]
["Panel Order Numbers",{"$f":"B$2","v":1},{"$f":"C$2","v":2},{"$f":"D$2","v":3},4,5,6,7,8,9,10,11,12,13,14,15,16,17,18,19,20,21,22,23,24,25]
[{"$f":"A$3","v":"FC721 = 1"},"S54400-C32-A2","S54400-C32-A3","S54400-C32-A1","--","--","--","--","--","--","--","--","--","--","--","--","--","--","--","--","--","--","--","--","--","--"]
[{"$f":"A$4","v":"FC722 = 2"},"S54400-C29-A5","S54400-C29-A4","S54400-C29-A2","S54400-C29-A1","S54400-C29-A3","S54400-C29-A7","S54400-C29-A6","--","--","--","--","--","--","--","--","--","--","--","--","--","--","--","--","--","--"]
[{"$f":"A$5","v":"FC723 = 3"},"S54400-C143-A1","--","--","--","--","--","--","--","--","--","--","--","--","--","--","--","--","--","--","--","--","--","--","--","--"]
[{"$f":"A$6","v":"FC724 = 4"},"S54400-C30-A2","S54400-C30-A3","S54400-C30-A1","S54400-C30-A4","--","--","--","--","--","--","--","--","--","--","--","--","--","--","--","--","--","--","--","--","--"]
[{"$f":"A$7","v":"FC726 = 5"},"S54400-C87-A1","S54400-C166-A2","--","--","--","--","--","--","--","--","--","--","--","--","--","--","--","--","--","--","--","--","--","--","--"]
[{"$f":"A$8","v":"FT724 = 6"},"S54400-C31-A2","S54400-C31-A1","--","--","--","--","--","--","--","--","--","--","--","--","--","--","--","--","--","--","--","--","--","--","--"]
[{"$f":"A$9","v":"FC728 = 7"}]
[{"$f":"A$10","v":"FG722 = 8"}]
[{"$f":"A$11","v":"FT728= 9"}]
[{"$f":"A$12","v":""}]
[{"$f":"A$13","v":""}]
[{"$f":"A$14","v":""}]
[{"$f":"A$15","v":""}]
[{"$f":"A$16","v":""}]
[{"$f":"A$17","v":""}]
[{"$f":"A$18","v":""}]
[{"$f":"A$19","v":""}]
[{"$f":"A$20","v":""}]
[]
[null,{"$f":"B$1","v":"Variants"}]
["Panel Descriptions",{"$f":"B$2","v":1},{"$f":"C$2","v":2},{"$f":"D$2","v":3},4,5,6,7,8,9,10,11,12,13,14,15,16,17,18,19,20,21,22,23,24,25]
[{"$f":"A$3","v":"FC721 = 1"},"International","24 zone LED indicator","NL, with EVAC (10-zone)","--","--","--","--","--","--","--","--","--","--","--","--","--","--","--","--","--","--","--","--","--","--"]
[{"$f":"A$4","v":"FC722 = 2"},"International","24 zone LED indicator","International","48 zone LED indicator","NL, with EVAC (10-zone)","24 zone LED indicator (AU)","24 zone LED indicator (AU)","--","--","--","--","--","--","--","--","--","--","--","--","--","--","--","--","--","--"]
[{"$f":"A$5","v":"FC723 = 3"},"International","--","--","--","--","--","--","--","--","--","--","--","--","--","--","--","--","--","--","--","--","--","--","--","--"]
[{"$f":"A$6","v":"FC724 = 4"},"International","48 zone LED indicator","NL, with EVAC (10-zone)","24 zone LED indicator (AU)","--","--","--","--","--","--","--","--","--","--","--","--","--","--","--","--","--","--","--","--","--"]
[{"$f":"A$7","v":"FC726 = 5"},"International","24 zone LED indicator (AU)","--","--","--","--","--","--","--","--","--","--","--","--","--","--","--","--","--","--","--","--","--","--","--"]
[{"$f":"A$8","v":"FT724 = 6"},"International","NL, with EVAC (10-zone)","--","--","--","--","--","--","--","--","--","--","--","--","--","--","--","--","--","--","--","--","--","--","--"]
[{"$f":"A$9","v":"FC728 = 7"}]
[{"$f":"A$10","v":"FG722 = 8"}]
[{"$f":"A$11","v":"FT728= 9"}]
[{"$f":"A$12","v":""}]
[{"$f":"A$13","v":""}]
[{"$f":"A$14","v":""}]
[{"$f":"A$15","v":""}]
[{"$f":"A$16","v":""}]
[{"$f":"A$17","v":""}]
[{"$f":"A$18","v":""}]
[{"$f":"A$19","v":""}]
[{"$f":"A$20","v":""}]
[]
[null,{"$f":"B$1","v":"Variants"}]
["Main CPU",{"$f":"B$2","v":1},{"$f":"C$2","v":2},{"$f":"D$2","v":3},4,5,6,7,8,9,10,11,12,13,14,15,16,17,18,19,20,21,22,23,24,25]
[{"$f":"A$3","v":"FC721 = 1"},"FCM2027","FCM2027","FCM2027","--","--","--","--","--","--","--","--","--","--","--","--","--","--","--","--","--","--","--","--","--","--"]
[{"$f":"A$4","v":"FC722 = 2"},"FCM2027","FCM2027","FCM2027","FCM2027","FCM2027","FCM2027","FCM2027","--","--","--","--","--","--","--","--","--","--","--","--","--","--","--","--","--","--"]
[{"$f":"A$5","v":"FC723 = 3"},"FCM2027","--","--","--","--","--","--","--","--","--","--","--","--","--","--","--","--","--","--","--","--","--","--","--","--"]
[{"$f":"A$6","v":"FC724 = 4"},"FCM2027","FCM2027","FCM2027","FCM2027","--","--","--","--","--","--","--","--","--","--","--","--","--","--","--","--","--","--","--","--","--"]
[{"$f":"A$7","v":"FC726 = 5"},"FCM2027","FCM2027","--","--","--","--","--","--","--","--","--","--","--","--","--","--","--","--","--","--","--","--","--","--","--"]
[{"$f":"A$8","v":"FT724 = 6"},"FCM2027","FCM2027","--","--","--","--","--","--","--","--","--","--","--","--","--","--","--","--","--","--","--","--","--","--","--"]
[{"$f":"A$9","v":"FC728 = 7"}]
[{"$f":"A$10","v":"FG722 = 8"}]
[{"$f":"A$11","v":"FT728= 9"}]
[{"$f":"A$12","v":""}]
[{"$f":"A$13","v":""}]
[{"$f":"A$14","v":""}]
[{"$f":"A$15","v":""}]
[{"$f":"A$16","v":""}]
[{"$f":"A$17","v":""}]
[{"$f":"A$18","v":""}]
[{"$f":"A$19","v":""}]
[{"$f":"A$20","v":""}]
[]
[null,{"$f":"B$1","v":"Variants"}]
["PMI Button",{"$f":"B$2","v":1},{"$f":"C$2","v":2},{"$f":"D$2","v":3},4,5,6,7,8,9,10,11,12,13,14,15,16,17,18,19,20,21,22,23,24,25]
[{"$f":"A$3","v":"FC721 = 1"},"--","--","--","--","--","--","--","--","--","--","--","--","--","--","--","--","--","--","--","--","--","--","--","--","--"]
[{"$f":"A$4","v":"FC722 = 2"},"--","--","--","--","--","--","--","--","--","--","--","--","--","--","--","--","--","--","--","--","--","--","--","--","--"]
[{"$f":"A$5","v":"FC723 = 3"},"--","--","--","--","--","--","--","--","--","--","--","--","--","--","--","--","--","--","--","--","--","--","--","--","--"]
[{"$f":"A$6","v":"FC724 = 4"},"--","--","--","--","--","--","--","--","--","--","--","--","--","--","--","--","--","--","--","--","--","--","--","--","--"]
[{"$f":"A$7","v":"FC726 = 5"},"--","--","--","--","--","--","--","--","--","--","--","--","--","--","--","--","--","--","--","--","--","--","--","--","--"]
[{"$f":"A$8","v":"FT724 = 6"},"--","--","--","--","--","--","--","--","--","--","--","--","--","--","--","--","--","--","--","--","--","--","--","--","--"]
[{"$f":"A$9","v":"FC728 = 7"}]
[{"$f":"A$10","v":"FG722 = 8"}]
[{"$f":"A$11","v":"FT728= 9"}]
[{"$f":"A$12","v":""}]
[{"$f":"A$13","v":""}]
[{"$f":"A$14","v":""}]
[{"$f":"A$15","v":""}]
[{"$f":"A$16","v":""}]
[{"$f":"A$17","v":""}]
[{"$f":"A$18","v":""}]
[{"$f":"A$19","v":""}]
[{"$f":"A$20","v":""}]
[]
[null,{"$f":"B$1","v":"Variants"}]
["Empty",{"$f":"B$2","v":1},{"$f":"C$2","v":2},{"$f":"D$2","v":3},4,5,6,7,8,9,10,11,12,13,14,15,16,17,18,19,20,21,22,23,24,25]
[{"$f":"A$3","v":"FC721 = 1"},"--","--","--","--","--","--","--","--","--","--","--","--","--","--","--","--","--","--","--","--","--","--","--","--","--"]
[{"$f":"A$4","v":"FC722 = 2"},"--","--","--","--","--","--","--","--","--","--","--","--","--","--","--","--","--","--","--","--","--","--","--","--","--"]
[{"$f":"A$5","v":"FC723 = 3"},"--","--","--","--","--","--","--","--","--","--","--","--","--","--","--","--","--","--","--","--","--","--","--","--","--"]
[{"$f":"A$6","v":"FC724 = 4"},"--","--","--","--","--","--","--","--","--","--","--","--","--","--","--","--","--","--","--","--","--","--","--","--","--"]
[{"$f":"A$7","v":"FC726 = 5"},"--","--","--","--","--","--","--","--","--","--","--","--","--","--","--","--","--","--","--","--","--","--","--","--","--"]
[{"$f":"A$8","v":"FT724 = 6"},"--","--","--","--","--","--","--","--","--","--","--","--","--","--","--","--","--","--","--","--","--","--","--","--","--"]
[{"$f":"A$9","v":"FC728 = 7"}]
[{"$f":"A$10","v":"FG722 = 8"}]
[{"$f":"A$11","v":"FT728= 9"}]
[{"$f":"A$12","v":""}]
[{"$f":"A$13","v":""}]
[{"$f":"A$14","v":""}]
[{"$f":"A$15","v":""}]
[{"$f":"A$16","v":""}]
[{"$f":"A$17","v":""}]
[{"$f":"A$18","v":""}]
[{"$f":"A$19","v":""}]
[{"$f":"A$20","v":""}]
[]
[null,"Variants"]
["Panel Peripherie",{"$f":"B$2","v":1},{"$f":"C$2","v":2},{"$f":"D$2","v":3},4,5,6,7,8,9,10,11,12,13,14,15,16,17,18,19,20,21,22,23,24,25]
[{"$f":"A$3","v":"FC721 = 1"},"FCI2010","FCI2010","FCI2010","--","--","--","--","--","--","--","--","--","--","--","--","--","--","--","--","--","--","--","--","--","--"]
[{"$f":"A$4","v":"FC722 = 2"},"FCI2002","FCI2002","FCI2002","FCI2002","FCI2002","FCI2002","FCI2002","--","--","--","--","--","--","--","--","--","--","--","--","--","--","--","--","--","--"]
[{"$f":"A$5","v":"FC723 = 3"},"FCI2002","--","--","--","--","--","--","--","--","--","--","--","--","--","--","--","--","--","--","--","--","--","--","--","--"]
[{"$f":"A$6","v":"FC724 = 4"},"FCI2004","FCI2004","FCI2004","FCI2004","--","--","--","--","--","--","--","--","--","--","--","--","--","--","--","--","--","--","--","--","--"]
[{"$f":"A$7","v":"FC726 = 5"},"FCI2004","FCI2004","--","--","--","--","--","--","--","--","--","--","--","--","--","--","--","--","--","--","--","--","--","--","--"]
[{"$f":"A$8","v":"FT724 = 6"},"FTI2001","FTI2001","--","--","--","--","--","--","--","--","--","--","--","--","--","--","--","--","--","--","--","--","--","--","--"]
[{"$f":"A$9","v":"FC728 = 7"}]
[{"$f":"A$10","v":"FG722 = 8"}]
[{"$f":"A$11","v":"FT728= 9"}]
[{"$f":"A$12","v":""}]
[{"$f":"A$13","v":""}]
[{"$f":"A$14","v":""}]
[{"$f":"A$15","v":""}]
[{"$f":"A$16","v":""}]
[{"$f":"A$17","v":""}]
[{"$f":"A$18","v":""}]
[{"$f":"A$19","v":""}]
[{"$f":"A$20","v":""}]
[]
[null,{"$f":"B$1","v":"Variants"}]
["Panel Extra Equipment",{"$f":"B$2","v":1},{"$f":"C$2","v":2},{"$f":"D$2","v":3},4,5,6,7,8,9,10,11,12,13,14,15,16,17,18,19,20,21,22,23,24,25]
[{"$f":"A$3","v":"FC721 = 1"},"--","1xLED","EVAC","--","--","--","--","--","--","--","--","--","--","--","--","--","--","--","--","--","--","--","--","--","--"]
[{"$f":"A$4","v":"FC722 = 2"},"--","1xLED","--","2xLED","EVAC","1xLED","--","--","--","--","--","--","--","--","--","--","--","--","--","--","--","--","--","--","--"]
[{"$f":"A$5","v":"FC723 = 3"},"--","--","--","--","--","--","--","--","--","--","--","--","--","--","--","--","--","--","--","--","--","--","--","--","--"]
[{"$f":"A$6","v":"FC724 = 4"},"--","2xLED","EVAC","1xLED","--","--","--","--","--","--","--","--","--","--","--","--","--","--","--","--","--","--","--","--","--"]
[{"$f":"A$7","v":"FC726 = 5"},"--","1xLED","--","--","--","--","--","--","--","--","--","--","--","--","--","--","--","--","--","--","--","--","--","--","--"]
[{"$f":"A$8","v":"FT724 = 6"},"--","EVAC","--","--","--","--","--","--","--","--","--","--","--","--","--","--","--","--","--","--","--","--","--","--","--"]
[{"$f":"A$9","v":"FC728 = 7"}]
[{"$f":"A$10","v":"FG722 = 8"}]
[{"$f":"A$11","v":"FT728= 9"}]
[{"$f":"A$12","v":""}]
[{"$f":"A$13","v":""}]
[{"$f":"A$14","v":""}]
[{"$f":"A$15","v":""}]
[{"$f":"A$16","v":""}]
[{"$f":"A$17","v":""}]
[{"$f":"A$18","v":""}]
[{"$f":"A$19","v":""}]
[{"$f":"A$20","v":""}]
[]
[null,{"$f":"B$1","v":"Variants"}]
["Operation Add-on",{"$f":"B$2","v":1},{"$f":"C$2","v":2},{"$f":"D$2","v":3},4,5,6,7,8,9,10,11,12,13,14,15,16,17,18,19,20,21,22,23,24,25]
[{"$f":"A$3","v":"FC721 = 1"},"show","show","show","--","--","--","--","--","--","--","--","--","--","--","--","--","--","--","--","--","--","--","--","--","--"]
[{"$f":"A$4","v":"FC722 = 2"},"show","show","show","show","show","show","show","--","--","--","--","--","--","--","--","--","--","--","--","--","--","--","--","--","--"]
[{"$f":"A$5","v":"FC723 = 3"},"show","--","--","--","--","--","--","--","--","--","--","--","--","--","--","--","--","--","--","--","--","--","--","--","--"]
[{"$f":"A$6","v":"FC724 = 4"},"show","show","show","show","--","--","--","--","--","--","--","--","--","--","--","--","--","--","--","--","--","--","--","--","--"]
[{"$f":"A$7","v":"FC726 = 5"},"show","show","--","--","--","--","--","--","--","--","--","--","--","--","--","--","--","--","--","--","--","--","--","--","--"]
[{"$f":"A$8","v":"FT724 = 6"},"show","show","--","--","--","--","--","--","--","--","--","--","--","--","--","--","--","--","--","--","--","--","--","--","--"]
[{"$f":"A$9","v":"FC728 = 7"}]
[{"$f":"A$10","v":"FG722 = 8"}]
[{"$f":"A$11","v":"FT728= 9"}]
[{"$f":"A$12","v":""}]
[{"$f":"A$13","v":""}]
[{"$f":"A$14","v":""}]
[{"$f":"A$15","v":""}]
[{"$f":"A$16","v":""}]
[{"$f":"A$17","v":""}]
[{"$f":"A$18","v":""}]
[{"$f":"A$19","v":""}]
[{"$f":"A$20","v":""}]
[]
[null,{"$f":"B$1","v":"Variants"}]
["Network&Communication PMI",{"$f":"B$2","v":1},{"$f":"C$2","v":2},{"$f":"D$2","v":3},4,5,6,7,8,9,10,11,12,13,14,15,16,17,18,19,20,21,22,23,24,25]
[{"$f":"A$3","v":"FC721 = 1"},"show","show","show","--","--","--","--","--","--","--","--","--","--","--","--","--","--","--","--","--","--","--","--","--","--"]
[{"$f":"A$4","v":"FC722 = 2"},"show","show","show","show","show","show","show","--","--","--","--","--","--","--","--","--","--","--","--","--","--","--","--","--","--"]
[{"$f":"A$5","v":"FC723 = 3"},"show","--","--","--","--","--","--","--","--","--","--","--","--","--","--","--","--","--","--","--","--","--","--","--","--"]
[{"$f":"A$6","v":"FC724 = 4"},"show","show","show","show","--","--","--","--","--","--","--","--","--","--","--","--","--","--","--","--","--","--","--","--","--"]
[{"$f":"A$7","v":"FC726 = 5"},"show","show","--","--","--","--","--","--","--","--","--","--","--","--","--","--","--","--","--","--","--","--","--","--","--"]
[{"$f":"A$8","v":"FT724 = 6"},"show","show","--","--","--","--","--","--","--","--","--","--","--","--","--","--","--","--","--","--","--","--","--","--","--"]
[{"$f":"A$9","v":"FC728 = 7"}]
[{"$f":"A$10","v":"FG722 = 8"}]
[{"$f":"A$11","v":"FT728= 9"}]
[{"$f":"A$12","v":""}]
[{"$f":"A$13","v":""}]
[{"$f":"A$14","v":""}]
[{"$f":"A$15","v":""}]
[{"$f":"A$16","v":""}]
[{"$f":"A$17","v":""}]
[{"$f":"A$18","v":""}]
[{"$f":"A$19","v":""}]
[{"$f":"A$20","v":""}]
[]
[null,"Variants"]
["Network&Communication Add-on",{"$f":"B$2","v":1},{"$f":"C$2","v":2},{"$f":"D$2","v":3},4,5,6,7,8,9,10,11,12,13,14,15,16,17,18,19,20,21,22,23,24,25]
[{"$f":"A$3","v":"FC721 = 1"},"show","show","show","--","--","--","--","--","--","--","--","--","--","--","--","--","--","--","--","--","--","--","--","--","--"]
[{"$f":"A$4","v":"FC722 = 2"},"show","show","show","show","show","show","show","--","--","--","--","--","--","--","--","--","--","--","--","--","--","--","--","--","--"]
[{"$f":"A$5","v":"FC723 = 3"},"show","--","--","--","--","--","--","--","--","--","--","--","--","--","--","--","--","--","--","--","--","--","--","--","--"]
[{"$f":"A$6","v":"FC724 = 4"},"show","show","show","show","--","--","--","--","--","--","--","--","--","--","--","--","--","--","--","--","--","--","--","--","--"]
[{"$f":"A$7","v":"FC726 = 5"},"show","show","--","--","--","--","--","--","--","--","--","--","--","--","--","--","--","--","--","--","--","--","--","--","--"]
[{"$f":"A$8","v":"FT724 = 6"},"show","show","--","--","--","--","--","--","--","--","--","--","--","--","--","--","--","--","--","--","--","--","--","--","--"]
[{"$f":"A$9","v":"FC728 = 7"}]
[{"$f":"A$10","v":"FG722 = 8"}]
[{"$f":"A$11","v":"FT728= 9"}]
[{"$f":"A$12","v":""}]
[{"$f":"A$13","v":""}]
[{"$f":"A$14","v":""}]
[{"$f":"A$15","v":""}]
[{"$f":"A$16","v":""}]
[{"$f":"A$17","v":""}]
[{"$f":"A$18","v":""}]
[{"$f":"A$19","v":""}]
[{"$f":"A$20","v":""}]
[]
[null,{"$f":"B$1","v":"Variants"}]
["Card cages",{"$f":"B$2","v":1},{"$f":"C$2","v":2},{"$f":"D$2","v":3},4,5,6,7,8,9,10,11,12,13,14,15,16,17,18,19,20,21,22,23,24,25]
[{"$f":"A$3","v":"FC721 = 1"},"--","--","--","--","--","--","--","--","--","--","--","--","--","--","--","--","--","--","--","--","--","--","--","--","--"]
[{"$f":"A$4","v":"FC722 = 2"},"--","--","--","--","--","--","--","--","--","--","--","--","--","--","--","--","--","--","--","--","--","--","--","--","--"]
[{"$f":"A$5","v":"FC723 = 3"},"FCA2007","--","--","--","--","--","--","--","--","--","--","--","--","--","--","--","--","--","--","--","--","--","--","--","--"]
[{"$f":"A$6","v":"FC724 = 4"},"--","--","--","--","--","--","--","--","--","--","--","--","--","--","--","--","--","--","--","--","--","--","--","--","--"]
[{"$f":"A$7","v":"FC726 = 5"},"FCA2008","FCA2008","--","--","--","--","--","--","--","--","--","--","--","--","--","--","--","--","--","--","--","--","--","--","--"]
[{"$f":"A$8","v":"FT724 = 6"},"--","--","--","--","--","--","--","--","--","--","--","--","--","--","--","--","--","--","--","--","--","--","--","--","--"]
[{"$f":"A$9","v":"FC728 = 7"}]
[{"$f":"A$10","v":"FG722 = 8"}]
[{"$f":"A$11","v":"FT728= 9"}]
[{"$f":"A$12","v":""}]
[{"$f":"A$13","v":""}]
[{"$f":"A$14","v":""}]
[{"$f":"A$15","v":""}]
[{"$f":"A$16","v":""}]
[{"$f":"A$17","v":""}]
[{"$f":"A$18","v":""}]
[{"$f":"A$19","v":""}]
[{"$f":"A$20","v":""}]
[]
[null,{"$f":"B$1","v":"Variants"}]
["CC5 Button",{"$f":"B$2","v":1},{"$f":"C$2","v":2},{"$f":"D$2","v":3},4,5,6,7,8,9,10,11,12,13,14,15,16,17,18,19,20,21,22,23,24,25]
[{"$f":"A$3","v":"FC721 = 1"},"--","--","--","--","--","--","--","--","--","--","--","--","--","--","--","--","--","--","--","--","--","--","--","--","--"]
[{"$f":"A$4","v":"FC722 = 2"},"--","--","--","--","--","--","--","--","--","--","--","--","--","--","--","--","--","--","--","--","--","--","--","--","--"]
[{"$f":"A$5","v":"FC723 = 3"},"--","--","--","--","--","--","--","--","--","--","--","--","--","--","--","--","--","--","--","--","--","--","--","--","--"]
[{"$f":"A$6","v":"FC724 = 4"},"--","--","--","--","--","--","--","--","--","--","--","--","--","--","--","--","--","--","--","--","--","--","--","--","--"]
[{"$f":"A$7","v":"FC726 = 5"},"--","--","--","--","--","--","--","--","--","--","--","--","--","--","--","--","--","--","--","--","--","--","--","--","--"]
[{"$f":"A$8","v":"FT724 = 6"},"--","--","--","--","--","--","--","--","--","--","--","--","--","--","--","--","--","--","--","--","--","--","--","--","--"]
[{"$f":"A$9","v":"FC728 = 7"}]
[{"$f":"A$10","v":"FG722 = 8"}]
[{"$f":"A$11","v":"FT728= 9"}]
[{"$f":"A$12","v":""}]
[{"$f":"A$13","v":""}]
[{"$f":"A$14","v":""}]
[{"$f":"A$15","v":""}]
[{"$f":"A$16","v":""}]
[{"$f":"A$17","v":""}]
[{"$f":"A$18","v":""}]
[{"$f":"A$19","v":""}]
[{"$f":"A$20","v":""}]
[]
[null,{"$f":"B$1","v":"Variants"}]
["Extinguishing",{"$f":"B$2","v":1},{"$f":"C$2","v":2},{"$f":"D$2","v":3},4,5,6,7,8,9,10,11,12,13,14,15,16,17,18,19,20,21,22,23,24,25]
[{"$f":"A$3","v":"FC721 = 1"},"--","--","--","--","--","--","--","--","--","--","--","--","--","--","--","--","--","--","--","--","--","--","--","--","--"]
[{"$f":"A$4","v":"FC722 = 2"},"--","--","Single","Single","Single","--","Single","--","--","--","--","--","--","--","--","--","--","--","--","--","--","--","--","--","--"]
[{"$f":"A$5","v":"FC723 = 3"},"--","--","--","--","--","--","--","--","--","--","--","--","--","--","--","--","--","--","--","--","--","--","--","--","--"]
[{"$f":"A$6","v":"FC724 = 4"},"Single","Single","Single","Single","--","--","--","--","--","--","--","--","--","--","--","--","--","--","--","--","--","--","--","--","--"]
[{"$f":"A$7","v":"FC726 = 5"},"--","--","--","--","--","--","--","--","--","--","--","--","--","--","--","--","--","--","--","--","--","--","--","--","--"]
[{"$f":"A$8","v":"FT724 = 6"},"--","--","--","--","--","--","--","--","--","--","--","--","--","--","--","--","--","--","--","--","--","--","--","--","--"]
[{"$f":"A$9","v":"FC728 = 7"}]
[{"$f":"A$10","v":"FG722 = 8"}]
[{"$f":"A$11","v":"FT728= 9"}]
[{"$f":"A$12","v":""}]
[{"$f":"A$13","v":""}]
[{"$f":"A$14","v":""}]
[{"$f":"A$15","v":""}]
[{"$f":"A$16","v":""}]
[{"$f":"A$17","v":""}]
[{"$f":"A$18","v":""}]
[{"$f":"A$19","v":""}]
[{"$f":"A$20","v":""}]
[]
[null,{"$f":"B$1","v":"Variants"}]
["Empty",{"$f":"B$2","v":1},{"$f":"C$2","v":2},{"$f":"D$2","v":3},4,5,6,7,8,9,10,11,12,13,14,15,16,17,18,19,20,21,22,23,24,25]
[{"$f":"A$3","v":"FC721 = 1"},"--","--","--","--","--","--","--","--","--","--","--","--","--","--","--","--","--","--","--","--","--","--","--","--","--"]
[{"$f":"A$4","v":"FC722 = 2"},"--","--","--","--","--","--","--","--","--","--","--","--","--","--","--","--","--","--","--","--","--","--","--","--","--"]
[{"$f":"A$5","v":"FC723 = 3"},"--","--","--","--","--","--","--","--","--","--","--","--","--","--","--","--","--","--","--","--","--","--","--","--","--"]
[{"$f":"A$6","v":"FC724 = 4"},"--","--","--","--","--","--","--","--","--","--","--","--","--","--","--","--","--","--","--","--","--","--","--","--","--"]
[{"$f":"A$7","v":"FC726 = 5"},"--","--","--","--","--","--","--","--","--","--","--","--","--","--","--","--","--","--","--","--","--","--","--","--","--"]
[{"$f":"A$8","v":"FT724 = 6"},"--","--","--","--","--","--","--","--","--","--","--","--","--","--","--","--","--","--","--","--","--","--","--","--","--"]
[{"$f":"A$9","v":"FC728 = 7"}]
[{"$f":"A$10","v":"FG722 = 8"}]
[{"$f":"A$11","v":"FT728= 9"}]
[{"$f":"A$12","v":""}]
[{"$f":"A$13","v":""}]
[{"$f":"A$14","v":""}]
[{"$f":"A$15","v":""}]
[{"$f":"A$16","v":""}]
[{"$f":"A$17","v":""}]
[{"$f":"A$18","v":""}]
[{"$f":"A$19","v":""}]
[{"$f":"A$20","v":""}]
[]
[null,{"$f":"B$1","v":"Variants"}]
["PS1: Panel Supply Equipm.",{"$f":"B$2","v":1},{"$f":"C$2","v":2},{"$f":"D$2","v":3},4,5,6,7,8,9,10,11,12,13,14,15,16,17,18,19,20,21,22,23,24,25]
[{"$f":"A$3","v":"FC721 = 1"},70,70,70,0,0,0,0,0,0,0,"--","--","--","--","--","--","--","--","--","--","--","--","--","--","--"]
[{"$f":"A$4","v":"FC722 = 2"},70,70,150,150,150,70,150,0,0,0,"--","--","--","--","--","--","--","--","--","--","--","--","--","--","--"]
[{"$f":"A$5","v":"FC723 = 3"},150,0,0,0,0,0,0,0,0,0,"--","--","--","--","--","--","--","--","--","--","--","--","--","--","--"]
[{"$f":"A$6","v":"FC724 = 4"},150,150,150,150,0,0,0,0,0,0,"--","--","--","--","--","--","--","--","--","--","--","--","--","--","--"]
[{"$f":"A$7","v":"FC726 = 5"},150,150,0,0,0,0,0,0,0,0,"--","--","--","--","--","--","--","--","--","--","--","--","--","--","--"]
[{"$f":"A$8","v":"FT724 = 6"},0,0,0,0,0,0,0,0,0,0,"--","--","--","--","--","--","--","--","--","--","--","--","--","--","--"]
[{"$f":"A$9","v":"FC728 = 7"}]
[{"$f":"A$10","v":"FG722 = 8"}]
[{"$f":"A$11","v":"FT728= 9"}]
[{"$f":"A$12","v":""}]
[{"$f":"A$13","v":""}]
[{"$f":"A$14","v":""}]
[{"$f":"A$15","v":""}]
[{"$f":"A$16","v":""}]
[{"$f":"A$17","v":""}]
[{"$f":"A$18","v":""}]
[{"$f":"A$19","v":""}]
[{"$f":"A$20","v":""}]
[]
[null,{"$f":"B$1","v":"Variants"}]
["PS1: Panels Housings",{"$f":"B$2","v":1},{"$f":"C$2","v":2},{"$f":"D$2","v":3},4,5,6,7,8,9,10,11,12,13,14,15,16,17,18,19,20,21,22,23,24,25]
[{"$f":"A$3","v":"FC721 = 1"},"eco","eco","eco","--","--","--","--","--","--","--","--","--","--","--","--","--","--","--","--","--","--","--","--","--","--"]
[{"$f":"A$4","v":"FC722 = 2"},"standard","standard","comfort","comfort","comfort","standard","comfort","--","--","--","--","--","--","--","--","--","--","--","--","--","--","--","--","--","--"]
[{"$f":"A$5","v":"FC723 = 3"},"comfort","--","--","--","--","--","--","--","--","--","--","--","--","--","--","--","--","--","--","--","--","--","--","--","--"]
[{"$f":"A$6","v":"FC724 = 4"},"comfort","comfort","comfort","comfort","--","--","--","--","--","--","--","--","--","--","--","--","--","--","--","--","--","--","--","--","--"]
[{"$f":"A$7","v":"FC726 = 5"},"large","large","--","--","--","--","--","--","--","--","--","--","--","--","--","--","--","--","--","--","--","--","--","--","--"]
[{"$f":"A$8","v":"FT724 = 6"},"eco","eco","--","--","--","--","--","--","--","--","--","--","--","--","--","--","--","--","--","--","--","--","--","--","--"]
[{"$f":"A$9","v":"FC728 = 7"}]
[{"$f":"A$10","v":"FG722 = 8"}]
[{"$f":"A$11","v":"FT728= 9"}]
[{"$f":"A$12","v":""}]
[{"$f":"A$13","v":""}]
[{"$f":"A$14","v":""}]
[{"$f":"A$15","v":""}]
[{"$f":"A$16","v":""}]
[{"$f":"A$17","v":""}]
[{"$f":"A$18","v":""}]
[{"$f":"A$19","v":""}]
[{"$f":"A$20","v":""}]
[]
[null,{"$f":"B$1","v":"Variants"}]
["PS1: Max. fitting supply",{"$f":"B$2","v":1},{"$f":"C$2","v":2},{"$f":"D$2","v":3},4,5,6,7,8,9,10,11,12,13,14,15,16,17,18,19,20,21,22,23,24,25]
[{"$f":"A$3","v":"FC721 = 1"},70,70,70,0,0,0,0,0,0,0,"--","--","--","--","--","--","--","--","--","--","--","--","--","--","--"]
[{"$f":"A$4","v":"FC722 = 2"},70,70,300,300,300,70,300,0,0,0,"--","--","--","--","--","--","--","--","--","--","--","--","--","--","--"]
[{"$f":"A$5","v":"FC723 = 3"},300,0,0,0,0,0,0,0,0,0,"--","--","--","--","--","--","--","--","--","--","--","--","--","--","--"]
[{"$f":"A$6","v":"FC724 = 4"},300,300,300,300,0,0,0,0,0,0,"--","--","--","--","--","--","--","--","--","--","--","--","--","--","--"]
[{"$f":"A$7","v":"FC726 = 5"},300,300,0,0,0,0,0,0,0,0,"--","--","--","--","--","--","--","--","--","--","--","--","--","--","--"]
[{"$f":"A$8","v":"FT724 = 6"},70,70,0,0,0,0,0,0,0,0,"--","--","--","--","--","--","--","--","--","--","--","--","--","--","--"]
[{"$f":"A$9","v":"FC728 = 7"}]
[{"$f":"A$10","v":"FG722 = 8"}]
[{"$f":"A$11","v":"FT728= 9"}]
[{"$f":"A$12","v":""}]
[{"$f":"A$13","v":""}]
[{"$f":"A$14","v":""}]
[{"$f":"A$15","v":""}]
[{"$f":"A$16","v":""}]
[{"$f":"A$17","v":""}]
[{"$f":"A$18","v":""}]
[{"$f":"A$19","v":""}]
[{"$f":"A$20","v":""}]
[]
[null,{"$f":"B$1","v":"Variants"}]
["PS1: Max. fitting battery",{"$f":"B$2","v":1},{"$f":"C$2","v":2},{"$f":"D$2","v":3},4,5,6,7,8,9,10,11,12,13,14,15,16,17,18,19,20,21,22,23,24,25]
[{"$f":"A$3","v":"FC721 = 1"},7,7,7,"--","--","--","--","--","--","--","--","--","--","--","--","--","--","--","--","--","--","--","--","--","--"]
[{"$f":"A$4","v":"FC722 = 2"},12,12,26,26,26,12,26,"--","--","--","--","--","--","--","--","--","--","--","--","--","--","--","--","--","--"]
[{"$f":"A$5","v":"FC723 = 3"},26,"--","--","--","--","--","--","--","--","--","--","--","--","--","--","--","--","--","--","--","--","--","--","--","--"]
[{"$f":"A$6","v":"FC724 = 4"},26,26,26,26,"--","--","--","--","--","--","--","--","--","--","--","--","--","--","--","--","--","--","--","--","--"]
[{"$f":"A$7","v":"FC726 = 5"},45,45,"--","--","--","--","--","--","--","--","--","--","--","--","--","--","--","--","--","--","--","--","--","--","--"]
[{"$f":"A$8","v":"FT724 = 6"},7,7,"--","--","--","--","--","--","--","--","--","--","--","--","--","--","--","--","--","--","--","--","--","--","--"]
[{"$f":"A$9","v":"FC728 = 7"}]
[{"$f":"A$10","v":"FG722 = 8"}]
[{"$f":"A$11","v":"FT728= 9"}]
[{"$f":"A$12","v":""}]
[{"$f":"A$13","v":""}]
[{"$f":"A$14","v":""}]
[{"$f":"A$15","v":""}]
[{"$f":"A$16","v":""}]
[{"$f":"A$17","v":""}]
[{"$f":"A$18","v":""},null,0]
[{"$f":"A$19","v":""},null,0]
[{"$f":"A$20","v":""}]
[]
[null,{"$f":"B$1","v":"Variants"}]
["Empty",{"$f":"B$2","v":1},{"$f":"C$2","v":2},{"$f":"D$2","v":3},4,5,6,7,8,9,10,11,12,13,14,15,16,17,18,19,20,21,22,23,24,25]
[{"$f":"A$3","v":"FC721 = 1"},"--","--","--","--","--","--","--","--","--","--","--","--","--","--","--","--","--","--","--","--","--","--","--","--","--"]
[{"$f":"A$4","v":"FC722 = 2"},"--","--","--","--","--","--","--","--","--","--","--","--","--","--","--","--","--","--","--","--","--","--","--","--","--"]
[{"$f":"A$5","v":"FC723 = 3"},"--","--","--","--","--","--","--","--","--","--","--","--","--","--","--","--","--","--","--","--","--","--","--","--","--"]
[{"$f":"A$6","v":"FC724 = 4"},"--","--","--","--","--","--","--","--","--","--","--","--","--","--","--","--","--","--","--","--","--","--","--","--","--"]
[{"$f":"A$7","v":"FC726 = 5"},"--","--","--","--","--","--","--","--","--","--","--","--","--","--","--","--","--","--","--","--","--","--","--","--","--"]
[{"$f":"A$8","v":"FT724 = 6"},"--","--","--","--","--","--","--","--","--","--","--","--","--","--","--","--","--","--","--","--","--","--","--","--","--"]
[{"$f":"A$9","v":"FC728 = 7"}]
[{"$f":"A$10","v":"FG722 = 8"}]
[{"$f":"A$11","v":"FT728= 9"}]
[{"$f":"A$12","v":""}]
[{"$f":"A$13","v":""}]
[{"$f":"A$14","v":""}]
[{"$f":"A$15","v":""}]
[{"$f":"A$16","v":""}]
[{"$f":"A$17","v":""}]
[{"$f":"A$18","v":""}]
[{"$f":"A$19","v":""}]
[{"$f":"A$20","v":""}]
[]
["2nd power supply",{"$f":"B$1","v":"Variants"}]
["PS2: Panel Supply Equipm.",{"$f":"B$2","v":1},{"$f":"C$2","v":2},{"$f":"D$2","v":3},4,5,6,7,8,9,10,11,12,13,14,15,16,17,18,19,20,21,22,23,24,25]
[{"$f":"A$3","v":"FC721 = 1"},0,0,0,0,0,0,0,0,0,0,"--","--","--","--","--","--","--","--","--","--","--","--","--","--","--"]
[{"$f":"A$4","v":"FC722 = 2"},0,0,0,0,0,0,0,0,0,0,"--","--","--","--","--","--","--","--","--","--","--","--","--","--","--"]
[{"$f":"A$5","v":"FC723 = 3"},0,0,0,0,0,0,0,0,0,0,"--","--","--","--","--","--","--","--","--","--","--","--","--","--","--"]
[{"$f":"A$6","v":"FC724 = 4"},0,0,0,0,0,0,0,0,0,0,"--","--","--","--","--","--","--","--","--","--","--","--","--","--","--"]
[{"$f":"A$7","v":"FC726 = 5"},0,0,0,0,0,0,0,0,0,0,"--","--","--","--","--","--","--","--","--","--","--","--","--","--","--"]
[{"$f":"A$8","v":"FT724 = 6"},0,0,0,0,0,0,0,0,0,0,"--","--","--","--","--","--","--","--","--","--","--","--","--","--","--"]
[{"$f":"A$9","v":"FC728 = 7"}]
[{"$f":"A$10","v":"FG722 = 8"}]
[{"$f":"A$11","v":"FT728= 9"}]
[{"$f":"A$12","v":""}]
[{"$f":"A$13","v":""}]
[{"$f":"A$14","v":""}]
[{"$f":"A$15","v":""}]
[{"$f":"A$16","v":""}]
[{"$f":"A$17","v":""}]
[{"$f":"A$18","v":""}]
[{"$f":"A$19","v":""}]
[{"$f":"A$20","v":""}]
[]
[null,{"$f":"B$1","v":"Variants"}]
["PS2: Panels Housings",{"$f":"B$2","v":1},{"$f":"C$2","v":2},{"$f":"D$2","v":3},4,5,6,7,8,9,10,11,12,13,14,15,16,17,18,19,20,21,22,23,24,25]
[{"$f":"A$3","v":"FC721 = 1"},"--","--","--","--","--","--","--","--","--","--","--","--","--","--","--","--","--","--","--","--","--","--","--","--","--"]
[{"$f":"A$4","v":"FC722 = 2"},"--","--","--","--","--","--","--","--","--","--","--","--","--","--","--","--","--","--","--","--","--","--","--","--","--"]
[{"$f":"A$5","v":"FC723 = 3"},"--","--","--","--","--","--","--","--","--","--","--","--","--","--","--","--","--","--","--","--","--","--","--","--","--"]
[{"$f":"A$6","v":"FC724 = 4"},"--","--","--","--","--","--","--","--","--","--","--","--","--","--","--","--","--","--","--","--","--","--","--","--","--"]
[{"$f":"A$7","v":"FC726 = 5"},"--","--","--","--","--","--","--","--","--","--","--","--","--","--","--","--","--","--","--","--","--","--","--","--","--"]
[{"$f":"A$8","v":"FT724 = 6"},"--","--","--","--","--","--","--","--","--","--","--","--","--","--","--","--","--","--","--","--","--","--","--","--","--"]
[{"$f":"A$9","v":"FC728 = 7"}]
[{"$f":"A$10","v":"FG722 = 8"}]
[{"$f":"A$11","v":"FT728= 9"}]
[{"$f":"A$12","v":""}]
[{"$f":"A$13","v":""}]
[{"$f":"A$14","v":""}]
[{"$f":"A$15","v":""}]
[{"$f":"A$16","v":""}]
[{"$f":"A$17","v":""}]
[{"$f":"A$18","v":""}]
[{"$f":"A$19","v":""}]
[{"$f":"A$20","v":""}]
[]
[null,{"$f":"B$1","v":"Variants"}]
["PS2: Max. fitting supply",{"$f":"B$2","v":1},{"$f":"C$2","v":2},{"$f":"D$2","v":3},4,5,6,7,8,9,10,11,12,13,14,15,16,17,18,19,20,21,22,23,24,25]
[{"$f":"A$3","v":"FC721 = 1"},0,0,0,0,0,0,0,0,0,0,"--","--","--","--","--","--","--","--","--","--","--","--","--","--","--"]
[{"$f":"A$4","v":"FC722 = 2"},0,0,0,0,0,0,0,0,0,0,"--","--","--","--","--","--","--","--","--","--","--","--","--","--","--"]
[{"$f":"A$5","v":"FC723 = 3"},0,0,0,0,0,0,0,0,0,0,"--","--","--","--","--","--","--","--","--","--","--","--","--","--","--"]
[{"$f":"A$6","v":"FC724 = 4"},0,0,0,0,0,0,0,0,0,0,"--","--","--","--","--","--","--","--","--","--","--","--","--","--","--"]
[{"$f":"A$7","v":"FC726 = 5"},0,0,0,0,0,0,0,0,0,0,"--","--","--","--","--","--","--","--","--","--","--","--","--","--","--"]
[{"$f":"A$8","v":"FT724 = 6"},0,0,0,0,0,0,0,0,0,0,"--","--","--","--","--","--","--","--","--","--","--","--","--","--","--"]
[{"$f":"A$9","v":"FC728 = 7"}]
[{"$f":"A$10","v":"FG722 = 8"}]
[{"$f":"A$11","v":"FT728= 9"}]
[{"$f":"A$12","v":""}]
[{"$f":"A$13","v":""}]
[{"$f":"A$14","v":""}]
[{"$f":"A$15","v":""}]
[{"$f":"A$16","v":""}]
[{"$f":"A$17","v":""}]
[{"$f":"A$18","v":""}]
[{"$f":"A$19","v":""}]
[{"$f":"A$20","v":""}]
[]
[null,{"$f":"B$1","v":"Variants"}]
["PS2: Max. fitting battery",{"$f":"B$2","v":1},{"$f":"C$2","v":2},{"$f":"D$2","v":3},4,5,6,7,8,9,10,11,12,13,14,15,16,17,18,19,20,21,22,23,24,25]
[{"$f":"A$3","v":"FC721 = 1"},"--","--","--","--","--","--","--","--","--","--","--","--","--","--","--","--","--","--","--","--","--","--","--","--","--"]
[{"$f":"A$4","v":"FC722 = 2"},"--","--","--","--","--","--","--","--","--","--","--","--","--","--","--","--","--","--","--","--","--","--","--","--","--"]
[{"$f":"A$5","v":"FC723 = 3"},"--","--","--","--","--","--","--","--","--","--","--","--","--","--","--","--","--","--","--","--","--","--","--","--","--"]
[{"$f":"A$6","v":"FC724 = 4"},"--","--","--","--","--","--","--","--","--","--","--","--","--","--","--","--","--","--","--","--","--","--","--","--","--"]
[{"$f":"A$7","v":"FC726 = 5"},"--","--","--","--","--","--","--","--","--","--","--","--","--","--","--","--","--","--","--","--","--","--","--","--","--"]
[{"$f":"A$8","v":"FT724 = 6"},"--","--","--","--","--","--","--","--","--","--","--","--","--","--","--","--","--","--","--","--","--","--","--","--","--"]
[{"$f":"A$9","v":"FC728 = 7"}]
[{"$f":"A$10","v":"FG722 = 8"}]
[{"$f":"A$11","v":"FT728= 9"}]
[{"$f":"A$12","v":""}]
[{"$f":"A$13","v":""}]
[{"$f":"A$14","v":""}]
[{"$f":"A$15","v":""}]
[{"$f":"A$16","v":""}]
[{"$f":"A$17","v":""}]
[{"$f":"A$18","v":""}]
[{"$f":"A$19","v":""}]
[{"$f":"A$20","v":""}]
[]
[null,{"$f":"B$1","v":"Variants"}]
["Empty",{"$f":"B$2","v":1},{"$f":"C$2","v":2},{"$f":"D$2","v":3},4,5,6,7,8,9,10,11,12,13,14,15,16,17,18,19,20,21,22,23,24,25]
[{"$f":"A$3","v":"FC721 = 1"},"--","--","--","--","--","--","--","--","--","--","--","--","--","--","--","--","--","--","--","--","--","--","--","--","--"]
[{"$f":"A$4","v":"FC722 = 2"},"--","--","--","--","--","--","--","--","--","--","--","--","--","--","--","--","--","--","--","--","--","--","--","--","--"]
[{"$f":"A$5","v":"FC723 = 3"},"--","--","--","--","--","--","--","--","--","--","--","--","--","--","--","--","--","--","--","--","--","--","--","--","--"]
[{"$f":"A$6","v":"FC724 = 4"},"--","--","--","--","--","--","--","--","--","--","--","--","--","--","--","--","--","--","--","--","--","--","--","--","--"]
[{"$f":"A$7","v":"FC726 = 5"},"--","--","--","--","--","--","--","--","--","--","--","--","--","--","--","--","--","--","--","--","--","--","--","--","--"]
[{"$f":"A$8","v":"FT724 = 6"},"--","--","--","--","--","--","--","--","--","--","--","--","--","--","--","--","--","--","--","--","--","--","--","--","--"]
[{"$f":"A$9","v":"FC728 = 7"},"--","--","--","--","--","--","--","--","--","--","--","--","--","--","--","--","--","--","--","--","--","--","--","--","--"]
[{"$f":"A$10","v":"FG722 = 8"},"--","--","--","--","--","--","--","--","--","--","--","--","--","--","--","--","--","--","--","--","--","--","--","--","--"]
[{"$f":"A$11","v":"FT728= 9"}]
[{"$f":"A$12","v":""}]
[{"$f":"A$13","v":""}]
[{"$f":"A$14","v":""}]
[{"$f":"A$15","v":""}]
[{"$f":"A$16","v":""}]
[{"$f":"A$17","v":""}]
[{"$f":"A$18","v":""}]
[{"$f":"A$19","v":""}]
[{"$f":"A$20","v":""}]

{"sheet":"CardCage2_Ref","index":6,"n_rows":72,"n_cols":14,"rows_kept":72,"cut":false,"hidden":true,"merged":[[22,0,22,11],[47,1,47,4],[47,5,47,6],[47,7,47,8],[47,9,47,10],[51,2,51,4],[48,2,48,4],[50,1,50,4],[51,9,51,10],[50,9,50,10],[48,9,48,10],[50,5,50,6],[50,7,50,8]]}
[null,"Planning of a card cage (2 slots)"]
[]
[null,"Purpose:"]
[null,"With the project planning of the card cage the load of the line cards are verified. This results in the definite:"]
[null,"- number of required line cards"]
[null,"- load of the line cards in idle and alarm state"]
[]
[null,"Procedure:"]
[null,"1) Define for every slot the type of line card"]
[null,"2) If you choose FCL2001, FCL7201 or FCL2006/7 line card, a separate sheet for the current calculation is generated"]
[null,"3) If you choose FCI2007, FCI2008 or FCI2009 fill out the current load direct in yellow fields"]
[null,"4) Fill out all generated sheets and push \"Calculate\" (updating current values from additional sheets)"]
[]
[null,"Please consider:"]
[null,"It is not possible to check all interactions of all options with each other. Restrictions in the use of options together are noted in the document A6V10210362 \"Planning\" and A6V10210390 \"Installation\"."]
[]
[null,"yellow fields","Must be filled in by the user"]
[null,"orange fields","Shows an input data error. These fields must be filled in by the user"]
[]
[null,"red fields","Calculated value, configuration invalid. Field must not be changed by the user."]
[null,"light green fields","Calculated value, additional information for the user. Field must not be changed by the user."]
[]
["Card cage (2 slots) FCA2007-A1"]
[]
[]
[null,null,"Nr.","Linecard","Text","I hcs12 [A]","I norm [A]","Corr. Factor","I max [A]","Remarks"]
[null,null,1,"none"," ",0,0,1,0,""]
[null,null,2,"Line card (C-NET) FCL2001-A1","Current consumption (at panel by 24V)",2.3E-2,0,1,1.5,"Values from \"C-NET_CC5-x_Slotx\" or other calculation"]
[null,null,3,"Linecard(SynoLOOP) FCL7201-A1","Current consumption (at panel by 24V)",2.3E-2,0,1,1.5,"Values from \"SynoLOOP_CC5-x_Slotx\" or other calculation"]
[null,null,4,"Linecard(Interactive/Ex) FCL2006-A1/FCL2007-A1","Current consumption (at panel by 24V)",2.3E-2,0,1,1.5,"Values from \"Interactive_CC5-x_Slotx\" or other calculation"]
[null,null,5,"I/O card (remote transmission) FCI2007-A1","Load on all outputs and external supplies",2.3E-2,7.0000000000000007E-2,{"$f":"(27.2/24)/0.95","v":1.1929824561403508},7,"Enter all loads on monitored outputs and external supply"]
[null,null,6,"I/O card (programmable) FCI2008-A1","Load on \"I/Os\" (I/Ox) and external supplies",2.3E-2,1.2999999999999999E-2,1,1.5,"Enter all loads on VSYS and on \"Configurable I/Os\" (I/Ox)"]
[null,null,7,"I/O card (horn/monitored) FCI2009-A1","Load on all monitored outputs",2.3E-2,5.5E-2,{"$f":"(27.2/24)/0.95","v":1.1929824561403508},8,"Enter all loads on all 8 monitored outputs"]
[null,null,8,"Line card (collective) FCL2002-A1","Current consumption (at panel by 24V)",2.3E-2,0,1,1.5,"Values from \"Collective_CC5-x_Slotx\" or other calculation"]
[null,null,9,"Line card (MS9i) FCL2003-A1","Current consumption (at panel by 24V)",2.3E-2,0,1,1.5,"Values from \"MS9I_CC5-x_Slotx\" or other calculation"]
[]
[]
[]
[]
[null,"Card cage slot 1",1,null,null,"Name of sheet"]
[null,"Card cage slot 2",1,null,null,"CardCage2_Ref"]
[]
[]
[]
[]
[]
[]
[null,"Card cage slot1",null,null,null,"quiescent current",null,"alarm current",null,"remarks",null,null,null,"CheckOk"]
[null,null,{"$f":"VLOOKUP($C$40,$C$27:$J$35,3,TRUE)","v":" "},null,null,0,"A",0,"A",{"$f":"VLOOKUP($C$40,$C$27:$J$38,8,TRUE)","v":""},null,null,null,{"$f":"IF(OR($F$49>VLOOKUP($C$40,$C$27:$K$35,7,FALSE),$F$49<0,$H$49>VLOOKUP($C$40,$C$27:$K$35,7,FALSE),$H$49<0),FALSE,TRUE)","v":true}]
[]
[null,"Card cage slot 2",null,null,null,"quiescent current",null,"alarm current",null,"remarks"]
[null,null,{"$f":"VLOOKUP($C$41,$C$27:$J$38,3,TRUE)","v":" "},null,null,0,"A",0,"A",{"$f":"VLOOKUP($C$41,$C$27:$J$38,8,TRUE)","v":""},null,null,null,{"$f":"IF(OR($F$52>VLOOKUP($C$41,$C$27:$K$35,7,FALSE),$F$52<0,$H$52>VLOOKUP($C$41,$C$27:$K$35,7,FALSE),$H$52<0),FALSE,TRUE)","v":true}]
[]
[null,null,null,"I norm [A]","I alarm [A]","U [V]","P norm [W]","P alarm [W]","Quant. [pcs]","P norm [W]","P alarm [W]"]
[null,"Quiet current con. module and card cage",null,1.9E-2,1.9E-2,24,{"$f":"D55*F55","v":0.45599999999999996},{"$f":"E55*F55","v":0.45599999999999996},1,{"$f":"G55*I55","v":0.45599999999999996},{"$f":"H55*I55","v":0.45599999999999996}]
[]
[]
[]
[]
[]
[]
[null,"Power consumption HCS12 - card cage slot 1",null,{"$f":"VLOOKUP($C40,$C$27:$K$35,4,FALSE)","v":0},{"$f":"D62","v":0},24,{"$f":"(C62+D62)*F62","v":0},{"$f":"(C62+E62)*F62","v":0},{"$f":"IF(C40>=2,1,0)","v":0},{"$f":"G62*I62","v":0},{"$f":"H62*I62","v":0}]
[null,"Power consumption HCS12 - card cage slot 2",null,{"$f":"VLOOKUP($C41,$C$27:$K$35,4,FALSE)","v":0},{"$f":"D63","v":0},24,{"$f":"(C63+D63)*F63","v":0},{"$f":"(C63+E63)*F63","v":0},{"$f":"IF(C41>=2,1,0)","v":0},{"$f":"G63*I63","v":0},{"$f":"H63*I63","v":0}]
[]
[]
[null,"Card cage slot 1",null,{"$f":"VLOOKUP($C40,$C$27:$K$35,5,FALSE)+F49*VLOOKUP($C40,$C$27:$K$35,6,FALSE)","v":0},{"$f":"VLOOKUP($C40,$C$27:$K$35,5,FALSE)+H49*VLOOKUP($C40,$C$27:$K$35,6,FALSE)","v":0},24,{"$f":"(C66+D66)*F66","v":0},{"$f":"(C66+E66)*F66","v":0},{"$f":"IF(C40>=2,1,0)","v":0},{"$f":"G66*I66","v":0},{"$f":"H66*I66","v":0}]
[null,"Card cage slot 2",null,{"$f":"VLOOKUP($C41,$C$27:$K$35,5,FALSE)+F52*VLOOKUP($C41,$C$27:$K$35,6,FALSE)","v":0},{"$f":"VLOOKUP($C41,$C$27:$K$35,5,FALSE)+H52*VLOOKUP($C41,$C$27:$K$35,6,FALSE)","v":0},24,{"$f":"(C67+D67)*F67","v":0},{"$f":"(C67+E67)*F67","v":0},{"$f":"IF(C41>=2,1,0)","v":0},{"$f":"G67*I67","v":0},{"$f":"H67*I67","v":0}]
[]
[]
[]
[null,null,null,null,null,null,null,null,null,"Pnorm total [W]","Palarm total [W]",null,null,"OveralCheck"]
[null,null,null,null,null,null,null,null,null,{"$f":"IF($N$72=TRUE,SUM(J$55:J$67),0)","v":0.45599999999999996},{"$f":"IF($N$72=TRUE,SUM(K$55:K$67),0)","v":0.45599999999999996},null,null,{"$f":"IF(AND(N49=TRUE,N52=TRUE),TRUE,FALSE)","v":true}]

{"sheet":"CardCage5_Ref","index":7,"n_rows":91,"n_cols":14,"rows_kept":91,"cut":false,"hidden":true,"merged":[[50,1,50,4],[90,4,90,6],[60,2,60,4],[57,2,57,4],[59,1,59,4],[59,5,59,6],[59,7,59,8],[54,2,54,4],[56,1,56,4],[56,5,56,6],[56,7,56,8],[60,9,60,10],[59,9,59,10],[57,9,57,10],[56,9,56,10],[54,9,54,10],[48,9,48,10],[53,9,53,10],[51,9,51,10],[50,9,50,10],[22,0,22,11],[47,1,47,4],[47,5,47,6],[47,7,47,8],[47,9,47,10],[50,5,50,6],[50,7,50,8],[53,7,53,8],[53,1,53,4],[53,5,53,6],[51,2,51,4],[48,2,48,4]]}
[null,"Planning of a card cage (5 slots)"]
[]
[null,"Purpose:"]
[null,"With the project planning of the card cage the load of the line cards are verified. This results in the definite:"]
[null,"- number of required line cards"]
[null,"- load of the line cards in idle and alarm state"]
[]
[null,"Procedure:"]
[null,"1) Define for every slot the type of line card"]
[null,"2) If you choose FCL2001, FCL7201 or FCL2006/7 line card, a separate sheet for the current calculation is generated"]
[null,"3) If you choose FCI2007, FCI2008 or FCI2009 fill out the current load direct in yellow fields"]
[null,"4) Fill out all generated sheets and push \"Calculate\" (updating current values from additional sheets)"]
[]
[null,"Please consider:"]
[null,"It is not possible to check all interactions of all options with each other. Restrictions in the use of options together are noted in the document A6V10210362 \"Planning\" and A6V10210390 \"Installation\"."]
[]
[null,"yellow fields","Must be filled in by the user"]
[null,"orange fields","Shows an input data error. These fields must be filled in by the user"]
[]
[null,"red fields","Calculated value, configuration invalid. Field must not be changed by the user."]
[null,"light green fields","Calculated value, additional information for the user. Field must not be changed by the user."]
[]
["Card cage (5 slots) FCA2008-A1"]
[]
[]
[null,null,"Nr.","Linecard","Text","I hcs12 [A]","I norm [A]","Corr. Factor","I max [A]","Remarks"]
[null,null,1,"none"," ",0,0,1,0,""]
[null,null,2,"Line card (C-NET) FCL2001-A1","Current consumption (at panel by 24V)",2.3E-2,0,1,1.5,"Values from \"C-NET_CC5-x_Slotx\" or other calculation"]
[null,null,3,"Linecard(SynoLOOP) FCL7201-A1","Current consumption (at panel by 24V)",2.3E-2,0,1,1.5,"Values from \"SynoLOOP_CC5-x_Slotx\" or other calculation"]
[null,null,4,"Linecard(Interactive/Ex) FCL2006-A1/FCL2007-A1","Current consumption (at panel by 24V)",2.3E-2,0,1,1.5,"Values from \"Interactive_CC5-x_Slotx\" or other calculation"]
[null,null,5,"I/O card (remote transmission) FCI2007-A1","Load on all outputs and external supplies",2.3E-2,7.0000000000000007E-2,{"$f":"(27.2/24)/0.95","v":1.1929824561403508},7,"Enter all loads on monitored outputs and external supply"]
[null,null,6,"I/O card (programmable) FCI2008-A1","Load on \"I/Os\" (I/Ox) and external supplies",2.3E-2,1.2999999999999999E-2,1,1.5,"Enter all loads on VSYS and on \"Configurable I/Os\" (I/Ox)"]
[null,null,7,"I/O card (horn/monitored) FCI2009-A1","Load on all monitored outputs",2.3E-2,5.5E-2,{"$f":"(27.2/24)/0.95","v":1.1929824561403508},8,"Enter all loads on all 8 monitored outputs"]
[null,null,8,"Line card (collective) FCL2002-A1","Current consumption (at panel by 24V)",2.3E-2,0,1,1.5,"Values from \"Collective_CC5-x_Slotx\" or other calculation"]
[null,null,9,"Line card (MS9i) FCL2003-A1","Current consumption (at panel by 24V)",2.3E-2,0,1,1.5,"Values from \"MS9I_CC5-x_Slotx\" or other calculation"]
[]
[]
[]
[]
[null,"Card cage slot 1",1,null,null,"Name of sheet"]
[null,"Card cage slot 2",1,null,null,"CardCage5_Ref"]
[null,"Card cage slot 3",1]
[null,"Card cage slot 4",1]
[null,"Card cage slot 5",1]
[]
[]
[]
[null,"Card cage slot 1",null,null,null,"quiescent current",null,"alarm current",null,"remarks",null,null,null,"CheckOk"]
[null,null,{"$f":"VLOOKUP($C$40,$C$27:$J$35,3,TRUE)","v":" "},null,null,0,"A",0,"A",{"$f":"VLOOKUP($C$40,$C$27:$J$35,8,TRUE)","v":""},null,null,null,{"$f":"IF(OR($F$49>VLOOKUP($C$40,$C$27:$K$35,7,FALSE),$F$49<0,$H$49>VLOOKUP($C$40,$C$27:$K$35,7,FALSE),$H$49<0),FALSE,TRUE)","v":true}]
[]
[null,"Card cage slot 2",null,null,null,"quiescent current",null,"alarm current",null,"remarks"]
[null,null,{"$f":"VLOOKUP($C$41,$C$27:$J$35,3,TRUE)","v":" "},null,null,0,"A",0,"A",{"$f":"VLOOKUP($C$41,$C$27:$J$35,8,TRUE)","v":""},null,null,null,{"$f":"IF(OR($F$52>VLOOKUP($C$41,$C$27:$K$35,7,FALSE),$F$52<0,$H$52>VLOOKUP($C$41,$C$27:$K$35,7,FALSE),$H$52<0),FALSE,TRUE)","v":true}]
[]
[null,"Card cage slot 3",null,null,null,"quiescent current",null,"alarm current",null,"remarks"]
[null,null,{"$f":"VLOOKUP($C$42,$C$27:$J$35,3,TRUE)","v":" "},null,null,0,"A",0,"A",{"$f":"VLOOKUP($C$42,$C$27:$J$35,8,TRUE)","v":""},null,null,null,{"$f":"IF(OR($F$55>VLOOKUP($C$42,$C$27:$K$35,7,FALSE),$F$55<0,$H$55>VLOOKUP($C$42,$C$27:$K$35,7,FALSE),$H$55<0),FALSE,TRUE)","v":true}]
[]
[null,"Card cage slot 4",null,null,null,"quiescent current",null,"alarm current",null,"remarks"]
[null,null,{"$f":"VLOOKUP($C$43,$C$27:$J$35,3,TRUE)","v":" "},null,null,0,"A",0,"A",{"$f":"VLOOKUP($C$43,$C$27:$J$35,8,TRUE)","v":""},null,null,null,{"$f":"IF(OR($F$58>VLOOKUP($C$43,$C$27:$K$35,7,FALSE),$F$58<0,$H$58>VLOOKUP($C$43,$C$27:$K$35,7,FALSE),$H$58<0),FALSE,TRUE)","v":true}]
[]
[null,"Card cage slot 5",null,null,null,"quiescent current",null,"alarm current",null,"remarks"]
[null,null,{"$f":"VLOOKUP($C$44,$C$27:$J$35,3,TRUE)","v":" "},null,null,0,"A",0,"A",{"$f":"VLOOKUP($C$44,$C$27:$J$35,8,TRUE)","v":""},null,null,null,{"$f":"IF(OR($F$61>VLOOKUP($C$44,$C$27:$K$35,7,FALSE),$F$61<0,$H$61>VLOOKUP($C$44,$C$27:$K$35,7,FALSE),$H$61<0),FALSE,TRUE)","v":true}]
[]
[null,null,null,"I norm [A]","I alarm [A]","U [V]","P norm [W]","P alarm [W]","Quant. [pcs]","P norm [W]","P alarm [W]"]
[null,"Quiet current con. module and card cage",null,1.9E-2,1.9E-2,24,{"$f":"D64*F64","v":0.45599999999999996},{"$f":"E64*F64","v":0.45599999999999996},1,{"$f":"G64*I64","v":0.45599999999999996},{"$f":"H64*I64","v":0.45599999999999996}]
[]
[]
[]
[]
[null,"Amount of module bus address",null,null,null,null,null,null,{"$f":"SUM(I71:I75)","v":0}]
[]
[null,"Power consumption HCS12 - card cage slot 1",null,{"$f":"VLOOKUP($C40,$C$27:$K$35,4,FALSE)","v":0},{"$f":"D71","v":0},24,{"$f":"(C71+D71)*F71","v":0},{"$f":"(C71+E71)*F71","v":0},{"$f":"IF(C40>=2,1,0)","v":0},{"$f":"G71*I71","v":0},{"$f":"H71*I71","v":0}]
[null,"Power consumption HCS12 - card cage slot 2",null,{"$f":"VLOOKUP($C41,$C$27:$K$35,4,FALSE)","v":0},{"$f":"D72","v":0},24,{"$f":"(C72+D72)*F72","v":0},{"$f":"(C72+E72)*F72","v":0},{"$f":"IF(C41>=2,1,0)","v":0},{"$f":"G72*I72","v":0},{"$f":"H72*I72","v":0}]
[null,"Power consumption HCS12 - card cage slot 3",null,{"$f":"VLOOKUP($C42,$C$27:$K$35,4,FALSE)","v":0},{"$f":"D73","v":0},24,{"$f":"(C73+D73)*F73","v":0},{"$f":"(C73+E73)*F73","v":0},{"$f":"IF(C42>=2,1,0)","v":0},{"$f":"G73*I73","v":0},{"$f":"H73*I73","v":0}]
[null,"Power consumption HCS12 - card cage slot 4",null,{"$f":"VLOOKUP($C43,$C$27:$K$35,4,FALSE)","v":0},{"$f":"D74","v":0},24,{"$f":"(C74+D74)*F74","v":0},{"$f":"(C74+E74)*F74","v":0},{"$f":"IF(C43>=2,1,0)","v":0},{"$f":"G74*I74","v":0},{"$f":"H74*I74","v":0}]
[null,"Power consumption HCS12 - card cage slot 5",null,{"$f":"VLOOKUP($C44,$C$27:$K$35,4,FALSE)","v":0},{"$f":"D75","v":0},24,{"$f":"(C75+D75)*F75","v":0},{"$f":"(C75+E75)*F75","v":0},{"$f":"IF(C44>=2,1,0)","v":0},{"$f":"G75*I75","v":0},{"$f":"H75*I75","v":0}]
[]
[]
[null,"Card cage slot 1",null,{"$f":"VLOOKUP($C40,$C$27:$K$35,5,FALSE)+F49*VLOOKUP($C40,$C$27:$K$35,6,FALSE)","v":0},{"$f":"VLOOKUP($C40,$C$27:$K$35,5,FALSE)+H49*VLOOKUP($C40,$C$27:$K$35,6,FALSE)","v":0},24,{"$f":"D78*F78","v":0},{"$f":"E78*F78","v":0},{"$f":"IF(C40>=2,1,0)","v":0},{"$f":"G78*I78","v":0},{"$f":"H78*I78","v":0}]
[null,"Card cage slot 2",null,{"$f":"VLOOKUP($C41,$C$27:$K$35,5,FALSE)+F52*VLOOKUP($C41,$C$27:$K$35,6,FALSE)","v":0},{"$f":"VLOOKUP($C41,$C$27:$K$35,5,FALSE)+H52*VLOOKUP($C41,$C$27:$K$35,6,FALSE)","v":0},24,{"$f":"D79*F79","v":0},{"$f":"E79*F79","v":0},{"$f":"IF(C41>=2,1,0)","v":0},{"$f":"G79*I79","v":0},{"$f":"H79*I79","v":0}]
[null,"Card cage slot 3",null,{"$f":"VLOOKUP($C42,$C$27:$K$35,5,FALSE)+F55*VLOOKUP($C42,$C$27:$K$35,6,FALSE)","v":0},{"$f":"VLOOKUP($C42,$C$27:$K$35,5,FALSE)+H55*VLOOKUP($C42,$C$27:$K$35,6,FALSE)","v":0},24,{"$f":"D80*F80","v":0},{"$f":"E80*F80","v":0},{"$f":"IF(C42>=2,1,0)","v":0},{"$f":"G80*I80","v":0},{"$f":"H80*I80","v":0}]
[null,"Card cage slot 4",null,{"$f":"VLOOKUP($C43,$C$27:$K$35,5,FALSE)+F58*VLOOKUP($C43,$C$27:$K$35,6,FALSE)","v":0},{"$f":"VLOOKUP($C43,$C$27:$K$35,5,FALSE)+H58*VLOOKUP($C43,$C$27:$K$35,6,FALSE)","v":0},24,{"$f":"D81*F81","v":0},{"$f":"E81*F81","v":0},{"$f":"IF(C43>=2,1,0)","v":0},{"$f":"G81*I81","v":0},{"$f":"H81*I81","v":0}]
[null,"Card cage slot 5",null,{"$f":"VLOOKUP($C44,$C$27:$K$35,5,FALSE)+F61*VLOOKUP($C44,$C$27:$K$35,6,FALSE)","v":0},{"$f":"VLOOKUP($C44,$C$27:$K$35,5,FALSE)+H61*VLOOKUP($C44,$C$27:$K$35,6,FALSE)","v":0},24,{"$f":"D82*F82","v":0},{"$f":"E82*F82","v":0},{"$f":"IF(C44>=2,1,0)","v":0},{"$f":"G82*I82","v":0},{"$f":"H82*I82","v":0}]
[]
[]
[]
[null,null,null,null,null,null,null,null,null,"Pnorm total [W]","Palarm total [W]",null,null,"OveralCheck"]
[null,null,null,null,null,null,{"$f":"IF($J$91=1,\"Total power consumption\",\"Only HCS12 is powerd with supply1\")","v":"Total power consumption"},null,null,{"$f":"IF($N$87=TRUE,IF($J$91=1,SUM(J$64:J$82),SUM($J$64:$J$75)),0)","v":0.45599999999999996},{"$f":"IF($N$87=TRUE,IF($J$91=1,SUM(K$64:K$82),SUM($K$64:$K$75)),0)","v":0.45599999999999996},null,null,{"$f":"IF(AND(N49=TRUE,N52=TRUE,N55=TRUE,N58=TRUE,N61=TRUE),TRUE,FALSE)","v":true}]
[null,null,null,null,null,null,{"$f":"IF($J$91=2,\"Linecards powerd over supply2\",IF($J$91=3,\"Linecards powerd over supply3\",\"\"))","v":""},null,null,{"$f":"IF($N$87=TRUE,IF($J$91>=2,SUM(J$78:J$82),0),0)","v":0},{"$f":"IF($N$87=TRUE,IF($J$91>=2,SUM(K$78:K$82),0),0)","v":0}]
[]
[]
[null,null,null,null,"module bus 1",null,null,null,null,1]

{"sheet":"CardCageCPU_Ref","index":8,"n_rows":98,"n_cols":14,"rows_kept":98,"cut":false,"hidden":true,"merged":[[22,0,22,11],[54,1,54,4],[54,5,54,6],[54,7,54,8],[54,9,54,10],[55,9,55,10],[60,9,60,10],[58,9,58,10],[57,9,57,10],[57,7,57,8],[63,7,63,8],[60,1,60,4],[60,5,60,6],[67,9,67,10],[66,9,66,10],[64,9,64,10],[63,9,63,10],[60,7,60,8],[66,7,66,8],[61,9,61,10],[58,2,58,4],[55,2,55,4],[57,1,57,4],[57,5,57,6],[67,2,67,4],[64,2,64,4],[66,1,66,4],[66,5,66,6],[61,2,61,4],[63,1,63,4],[63,5,63,6]]}
[null,"Planning of a card cage (CPU)"]
[]
[null,"Purpose:"]
[null,"With the project planning of the card cage the load of the line cards are verified. This results in the definite:"]
[null,"- number of required line cards"]
[null,"- load of the line cards in idle and alarm state"]
[]
[null,"Procedure:"]
[null,"1) Define for every slot the typ of line card"]
[null,"2) If you choose FCL2001, FCL2002, FCL2003, FCL2005 or FCL2006/7 line card, a seperate sheet for the current calculation is generated"]
[null,"3) If you choose FCI2007, FCI2008 or FCI2009 fill out the current load direct in yellow fields"]
[null,"4) Fill out all generated sheets and push \"Calculate\" (updating current values from additional sheets)"]
[]
[null,"Please consider:"]
[null,"It is not possible to check all interactions of all options with each other. Restrictions in the use of options together are noted in the document 008843 \"Planning\" and 008851 \"Installation\"."]
[]
[null,"yellow fields","Must be filled in by the user"]
[null,"orange fields","Shows an input data error. These fields must be filled in by the user"]
[]
[null,"red fields","Calculated value, configuration invalid. Field must not be changed by the user."]
[null,"light green fields","Calculated value, additional information for the user. Field must not be changed by the user."]
[]
["Card cage (CPU) FCC2003-A1"]
[]
[]
[null,null,"Nr.","Linecard","Text","I hcs12 [A]","I norm [A]","Corr. Factor","I max [A]","Remarks"]
[null,null,1,"none"," ",0,0,1,0,""]
[null,null,2,"Line card (FDnet) FCL2001-A1","Current consumption (at panel by 24V)",2.3E-2,0,1,1.5,"Values from \"FDnet_CC5-x_Slotx\" or other calculation"]
[null,null,3,"Line card (collective) FCL2002-A1","Current consumption (at panel by 24V)",2.3E-2,0,1,1.5,"Values from \"Collective_CC5-x_Slotx\" or other calculation"]
[null,null,4,"Line card (MS9i) FCL2003-A1","Current consumption (at panel by 24V)",2.3E-2,0,1,1.5,"Values from \"MS9I_CC5-x_Slotx\" or other calculation"]
[null,null,5,"Linecard(AnalogPLUS) FCL2005-A1","Current consumption (at panel by 24V)",2.3E-2,0,1,1.5,"Values from \"AnalogPLUS_CC5-x_Slotx\" or other calculation"]
[null,null,6,"Linecard(Interactive/Ex) FCL2006-A1/FCL2007-A1","Current consumption (at panel by 24V)",2.3E-2,0,1,1.5,"Values from \"Interactive_CC5-x_Slotx\" or other calculation"]
[null,null,7,"I/O card (remote transmission) FCI2007-A1","Load on all outputs and external supplies",2.3E-2,7.0000000000000007E-2,{"$f":"(27.2/24)/0.95","v":1.1929824561403508},7,"Enter all loads on monitored outputs and external supply"]
[null,null,8,"I/O card (programmable) FCI2008-A1","Load on \"I/Os\" (I/Ox) and external supplies",2.3E-2,1.2999999999999999E-2,1,1.5,"Enter all loads on VSYS and on \"Configurable I/Os\" (I/Ox)"]
[null,null,9,"I/O card (horn/monitored) FCI2009-A1","Load on all monitored outputs",2.3E-2,5.5E-2,{"$f":"(27.2/24)/0.95","v":1.1929824561403508},8,"Enter all loads on all 8 monitored outputs"]
[]
[]
[]
[null,null,null,"CPU Card",null,"Text",null,"I  [A]","I max [A]","Remarks"]
[null,null,1,"none",null," ",null,0,0,""]
[null,null,2,"CPU Card FCC2004-A1 ",null,"Including SAFEDLINK",null,0.18,0.18,""]
[]
[null,null,null,"Comm Card",null,"Text",null,"I  [A]","I max [A]","Remarks"]
[null,null,1,"Communication Card (FC2080) FCC2005-A1",null,"Including SAFEDLINK",null,0.11,0.11,""]
[null,null,2,"Communication Card (FC2080) FCC2005-A1 ",null,"",null,0.09,0.09,""]
[]
[null,"Card cage slot 1",20,"fix slot",null,"Name of sheet"]
[null,"Card cage slot 2",1,null,null,"CardCageCPU_Ref"]
[null,"Card cage slot 3",20,"fix slot"]
[null,"Card cage slot 4",1]
[null,"Card cage slot 5",1]
[]
[]
[]
[null,"Card cage slot 1",null,null,null,"quiescent current",null,"alarm current",null,"remarks",null,null,null,"CheckOk"]
[null," CPU Card FCC2004-A1 ","Including SAFEDLINK",null,null,0.18,"A",0.18,"A",""]
[]
[null,"Card cage slot 2",null,null,null,"quiescent current",null,"alarm current",null,"remarks"]
[null,null,{"$f":"VLOOKUP($C$48,$C$40:$J$41,4,TRUE)","v":" "},null,null,{"$f":"VLOOKUP($C$48,$C$40:$J$41,6,TRUE)","v":0},"A",{"$f":"VLOOKUP($C$48,$C$40:$J$41,7,TRUE)","v":0},"A",{"$f":"VLOOKUP($C$48,$C$40:$J$41,8,TRUE)","v":""}]
[]
[null,"Card cage slot 3",null,null,null,"quiescent current",null,"alarm current",null,"remarks"]
[null,"Com. Card FCC2005-A1 or FCC2008-D1",{"$f":"VLOOKUP($C48,$C$44:$K$45,4,FALSE)","v":"Including SAFEDLINK"},null,null,{"$f":"VLOOKUP($C48,$C$44:$K$45,6,FALSE)","v":0.11},"A",{"$f":"VLOOKUP($C48,$C$44:$K$45,7,FALSE)","v":0.11},"A",""]
[]
[null,"Card cage slot 4",null,null,null,"quiescent current",null,"alarm current",null,"remarks"]
[null,null,{"$f":"VLOOKUP($C$50,$C$27:$J$35,3,TRUE)","v":" "},null,null,0,"A",0,"A",{"$f":"VLOOKUP($C$50,$C$27:$J$35,8,TRUE)","v":""},null,null,null,{"$f":"IF(OR($F$65>VLOOKUP($C$50,$C$27:$K$35,7,FALSE),$F$65<0,$H$65>VLOOKUP($C$50,$C$27:$K$35,7,FALSE),$H$65<0),FALSE,TRUE)","v":true}]
[]
[null,"Card cage slot 5",null,null,null,"quiescent current",null,"alarm current",null,"remarks"]
[null,null,{"$f":"VLOOKUP($C$51,$C$27:$J$38,3,TRUE)","v":" "},null,null,0,"A",0,"A",{"$f":"VLOOKUP($C$51,$C$27:$J$35,8,TRUE)","v":""},null,null,null,{"$f":"IF(OR($F$68>VLOOKUP($C$51,$C$27:$K$35,7,FALSE),$F$68<0,$H$68>VLOOKUP($C$51,$C$27:$K$35,7,FALSE),$H$68<0),FALSE,TRUE)","v":true}]
[]
[null,null,null,"I norm [A]","I alarm [A]","U [V]","P norm [W]","P alarm [W]","Quant. [pcs]","P norm [W]","P alarm [W]"]
[]
[]
[]
[]
[]
[null,"Amount of module bus address",null,null,null,null,null,null,{"$f":"SUM(I81:I82)","v":0}]
[]
[null,"Power consump. CPU Card - card cage slot 1",null,{"$f":"F56","v":0.18},{"$f":"D78","v":0.18},24,{"$f":"(C78+D78)*F78","v":4.32},{"$f":"(C78+E78)*F78","v":4.32},{"$f":"IF(C47>=2,1,0)","v":1},{"$f":"G78*I78","v":4.32},{"$f":"H78*I78","v":4.32}]
[null,"Power cons. 2nd CPU Card - card cage slot 2",null,{"$f":"VLOOKUP($C48,$C$40:$K$41,6,FALSE)","v":0},{"$f":"D79","v":0},24,{"$f":"(C79+D79)*F79","v":0},{"$f":"(C79+E79)*F79","v":0},{"$f":"IF(C48>=2,1,0)","v":0},{"$f":"G79*I79","v":0},{"$f":"H79*I79","v":0}]
[null,"Power consump. ComCard - card cage slot 3",null,{"$f":"F62","v":0.11},{"$f":"D80","v":0.11},24,{"$f":"(C80+D80)*F80","v":2.64},{"$f":"(C80+E80)*F80","v":2.64},{"$f":"IF(C49>=2,1,0)","v":1},{"$f":"G80*I80","v":2.64},{"$f":"H80*I80","v":2.64}]
[null,"Power consumption HCS12 - card cage slot 4",null,{"$f":"VLOOKUP($C50,$C$27:$K$35,4,FALSE)","v":0},{"$f":"D81","v":0},24,{"$f":"(C81+D81)*F81","v":0},{"$f":"(C81+E81)*F81","v":0},{"$f":"IF(C50>=2,1,0)","v":0},{"$f":"G81*I81","v":0},{"$f":"H81*I81","v":0}]
[null,"Power consumption HCS12 - card cage slot 5",null,{"$f":"VLOOKUP($C51,$C$27:$K$35,4,FALSE)","v":0},{"$f":"D82","v":0},24,{"$f":"(C82+D82)*F82","v":0},{"$f":"(C82+E82)*F82","v":0},{"$f":"IF(C51>=2,1,0)","v":0},{"$f":"G82*I82","v":0},{"$f":"H82*I82","v":0}]
[]
[]
[]
[null,"Card cage slot 1",null,null,null,24,{"$f":"D86*F86","v":0},{"$f":"E86*F86","v":0},{"$f":"IF(C47>=2,1,0)","v":1},{"$f":"G86*I86","v":0},{"$f":"H86*I86","v":0}]
[null,"Card cage slot 2",null,null,null,24,{"$f":"D87*F87","v":0},{"$f":"E87*F87","v":0},{"$f":"IF(C48>=2,1,0)","v":0},{"$f":"G87*I87","v":0},{"$f":"H87*I87","v":0}]
[null,"Card cage slot 3",null,null,null,24,{"$f":"D88*F88","v":0},{"$f":"E88*F88","v":0},{"$f":"IF(C49>=2,1,0)","v":1},{"$f":"G88*I88","v":0},{"$f":"H88*I88","v":0}]
[null,"Card cage slot 4",null,{"$f":"VLOOKUP($C50,$C$27:$K$35,5,FALSE)+F65*VLOOKUP($C50,$C$27:$K$35,6,FALSE)","v":0},{"$f":"VLOOKUP($C50,$C$27:$K$35,5,FALSE)+H65*VLOOKUP($C50,$C$27:$K$35,6,FALSE)","v":0},24,{"$f":"D89*F89","v":0},{"$f":"E89*F89","v":0},{"$f":"IF(C50>=2,1,0)","v":0},{"$f":"G89*I89","v":0},{"$f":"H89*I89","v":0}]
[null,"Card cage slot 5",null,{"$f":"VLOOKUP($C51,$C$27:$K$35,5,FALSE)+F68*VLOOKUP($C51,$C$27:$K$35,6,FALSE)","v":0},{"$f":"VLOOKUP($C51,$C$27:$K$35,5,FALSE)+H68*VLOOKUP($C51,$C$27:$K$35,6,FALSE)","v":0},24,{"$f":"D90*F90","v":0},{"$f":"E90*F90","v":0},{"$f":"IF(C51>=2,1,0)","v":0},{"$f":"G90*I90","v":0},{"$f":"H90*I90","v":0}]
[]
[]
[]
[null,null,null,null,null,null,null,null,null,"Pnorm total [W]","Palarm total [W]",null,null,"OveralCheck"]
[null,null,null,null,null,null,"Total power consumption",null,null,{"$f":"IF($N$95=TRUE, SUM(J$71:J$90),0)","v":6.9600000000000009},{"$f":"IF($N$95=TRUE,SUM(K$71:K$90),0)","v":6.9600000000000009},null,null,{"$f":"IF(AND(N65=TRUE,N68=TRUE),TRUE,FALSE)","v":true}]
[]
[null,null,null,null,null,null,null,null,null,"Power Supply"]
[null,null,null,null,null,null,null,null,null,1]

{"sheet":"FDnet_Ref","index":9,"n_rows":583,"n_cols":32,"rows_kept":583,"cut":false,"hidden":true,"merged":[[331,1,331,13],[341,16,341,17],[341,14,341,15],[45,0,45,18],[79,2,79,17],[80,2,80,5],[80,6,80,9],[80,10,80,13],[80,14,80,17],[81,2,81,3],[81,4,81,5],[81,6,81,7],[81,8,81,9],[81,10,81,11],[81,12,81,13],[81,14,81,15],[81,16,81,17],[381,14,381,15],[381,16,381,17],[360,4,360,5],[360,6,360,7],[360,8,360,9],[360,10,360,11],[360,12,360,13],[360,14,360,15],[360,16,360,17],[350,1,350,13],[360,2,360,3],[341,2,341,3],[341,4,341,5],[341,6,341,7],[341,8,341,9],[383,2,383,3],[383,4,383,5],[383,6,383,7],[383,8,383,9],[383,10,383,11],[383,12,383,13],[381,2,381,3],[381,4,381,5],[381,6,381,7],[381,8,381,9],[381,10,381,11],[381,12,381,13],[341,10,341,11],[341,12,341,13],[383,14,383,15],[383,16,383,17],[384,2,384,3],[384,4,384,5],[384,6,384,7],[384,8,384,9],[384,10,384,11],[384,12,384,13],[384,14,384,15],[384,16,384,17],[385,2,385,3],[385,4,385,5],[385,6,385,7],[385,8,385,9],[385,10,385,11],[385,12,385,13],[385,14,385,15],[385,16,385,17],[389,2,389,3],[389,4,389,5],[389,6,389,7],[389,8,389,9],[389,10,389,11],[389,12,389,13],[389,14,389,15],[389,16,389,17],[391,2,391,3],[391,4,391,5],[391,6,391,7],[391,8,391,9],[391,10,391,11],[391,12,391,13],[391,14,391,15],[391,16,391,17],[397,2,397,3],[397,4,397,5],[397,6,397,7],[397,8,397,9],[397,10,397,11],[397,12,397,13],[397,14,397,15],[397,16,397,17],[400,2,400,3],[400,4,400,5],[400,6,400,7],[400,8,400,9],[400,10,400,11],[400,12,400,13],[400,14,400,15],[400,16,400,17],[403,0,403,18],[405,2,405,17],[406,2,406,3],[406,4,406,5],[406,6,406,7],[406,8,406,9],[406,10,406,11],[406,12,406,13],[406,14,406,15],[406,16,406,17],[415,4,415,5],[415,6,415,7],[415,8,415,9],[415,10,415,11],[416,14,416,15],[416,16,416,17],[413,2,413,3],[413,4,413,5],[413,6,413,7],[413,8,413,9],[413,10,413,11],[413,12,413,13],[413,14,413,15],[413,16,413,17],[415,12,415,13],[415,14,415,15],[415,16,415,17],[414,2,414,3],[414,4,414,5],[414,6,414,7],[414,8,414,9],[414,10,414,11],[414,12,414,13],[473,0,473,18],[434,2,434,17],[435,2,435,5],[435,6,435,9],[435,10,435,13],[435,14,435,17],[416,2,416,3],[416,4,416,5],[416,6,416,7],[436,2,436,3],[436,4,436,5],[436,6,436,7],[436,8,436,9],[436,10,436,11],[436,12,436,13],[436,14,436,15],[436,16,436,17],[416,8,416,9],[416,10,416,11],[416,12,416,13],[475,2,475,17],[476,2,476,3],[476,4,476,5],[476,6,476,7],[476,8,476,9],[476,10,476,11],[476,12,476,13],[476,14,476,15],[476,16,476,17],[478,2,478,3],[478,4,478,5],[478,6,478,7],[478,8,478,9],[478,10,478,11],[478,12,478,13],[478,14,478,15],[478,16,478,17],[479,2,479,17],[489,2,489,3],[489,4,489,5],[489,6,489,7],[489,8,489,9],[489,10,489,11],[489,12,489,13],[489,14,489,15],[489,16,489,17],[490,14,490,15],[490,16,490,17],[490,2,490,3],[490,4,490,5],[490,6,490,7],[490,8,490,9],[490,10,490,11],[490,12,490,13],[491,2,491,17],[522,2,522,17],[523,2,523,3],[523,4,523,5],[523,6,523,7],[523,8,523,9],[523,10,523,11],[523,12,523,13],[523,14,523,15],[523,16,523,17],[535,2,535,17],[536,2,536,17],[537,2,537,17],[540,2,540,17],[541,2,541,3],[541,4,541,5],[541,6,541,7],[541,8,541,9],[541,10,541,11],[541,12,541,13],[554,10,554,11],[577,8,577,9],[577,10,577,11],[541,14,541,15],[575,2,575,17],[577,12,577,13],[577,14,577,15],[577,16,577,17],[541,16,541,17],[546,2,546,17],[547,2,547,17],[79,23,79,25],[80,21,80,22],[80,20,81,20],[80,23,81,23],[80,24,80,25],[465,2,465,3],[465,4,465,5],[465,6,465,7],[465,8,465,9],[465,10,465,11],[465,12,465,13],[465,14,465,15],[465,16,465,17],[447,2,447,3],[447,4,447,5],[447,6,447,7],[447,8,447,9],[447,10,447,11],[447,12,447,13],[447,14,447,15],[447,16,447,17],[414,14,414,15],[414,16,414,17],[415,2,415,3],[582,2,582,3],[582,4,582,5],[582,6,582,7],[582,8,582,9],[582,10,582,11],[582,12,582,13],[582,14,582,15],[582,16,582,17],[79,20,79,22],[580,2,580,17],[578,2,578,17],[554,12,554,13],[554,14,554,15],[554,16,554,17],[570,2,570,17],[571,2,571,17],[577,2,577,3],[577,4,577,5],[577,6,577,7],[553,2,553,17],[554,2,554,3],[554,4,554,5],[554,6,554,7],[554,8,554,9]]}
[null,"Planning of C-NET detector lines (one line card or one module)"]
[]
[null,"Purpose:"]
[null,"With the project planning of the detector line the load of the line card is verified. This results in the definite:"]
[null,"- number and type of devices per detector line"]
[null,"- number of required line cards"]
[null,"- number of loops and stubs"]
[null,"- load of the panel in idle and alarm state"]
[]
[null,"Procedure:"]
[null,"1.) Define the types and positions of the detector line devices in the building"]
[null,"2.) Define and choose the topology of the detector lines (loop or stub)"]
[null,"3.) Choose correct Alarm indicator extras (per loop/stub)"]
[null,"--> None: At Alarm state Indicator flashing every 1s (10 Internal and 10 External AI's)"]
[null,"--> Steady ON: At alarm state Indicator Steady ON (32 AI's)"]
[null,"--> Operation Indicator: At Quiet state Indicator flashing every 1s (All AI's), at Alarm state Steady ON (10 AI's)"]
[null,"4.) Enter the number of devices per loop / stub in the table"]
[null,"-> If Ex-devices are installed, enable Ex-line adaptor (max. 1 per stub / 2 per loop)"]
[null,"5.) Define the cable length according to the building plan"]
[null,"-> Length for resistor- or capacity calculation must be calculated independent according to document A6V10210362"]
[null,"-> Ex-Stub cable length needs not be entered (according to A6V10324618 and A6V10333771)"]
[null,"6.) Choose cable type or enter cable parameters manually"]
[null,"7.) Choose calculation characteristics"]
[null,"--> Worst case: All devices are placed at end of line for calculation"]
[null,"--> Equally: All devices are distributed equally over cable length. Possibility to add extra start and end cable length"]
[null,"8.) Add start and end cable length in case of equally calculation"]
[null,"9.) Check that no input field is orange"]
[null,"10.) All data are now complete, push \"Calculation Button\" to calculate the configuration."]
[null,"--> If all analysis field are clear and \"Calculation Button\" is green, configuration is valid"]
[null,"--> If some analysis field are red and \"Calculation Button\" is red, change parameters to get a valid configuration"]
[]
[null,"Please consider:"]
[null,"If a control is connected to an external AI, this must be entered at Ext. AI-Control rows"]
[]
[null,"yellow fields - Must be filled in by the user"]
[null,"orange fields - Shows an input data error. These fields must be filled in by the user"]
[null,"red fields - Calculated value, configuration not valid"]
[null,"clear fields - Calculated value, additional information for the user"]
[]
[]
[]
[]
[]
[]
[]
["Input number of devices"]
[]
[null,"Help values",null,null,null,null,null,null,null,null,null,null,null,null,null,null,null,null,null,null,"Abbreviations"]
[null,null,null,null,null,null,null,null,null,null,null,null,null,null,null,null,null,null,null,null,"FDnetAK:  FDnet Adressindex (Adresskennzahl), Number of by the device used bus-addresses (including sub-addresses)"]
[null,null,"Loop / Stub",null,null,null,"Loop / Stub",null,null,null,"Loop / Stub",null,null,null,"Loop / Stub",null,null,null,null,null,"FDnetRK: FDnet Ruhestromkennzahl (Quietindex); average current of the device in idle state (in load factors). Necessary to calculate the emergency power"]
[null,null,"Stubs",null,null,null,"Stubs",null,null,null,"Stubs",null,null,null,"Stubs",null,null,null,null,null,"FDnetMK: FDnet Melderkennzahl (Deviceindex); maximal average current of the device, normally in alarm state (in load factors), without internal or external AI"]
[null,null,null,null,null,null,null,null,null,null,null,null,null,null,null,null,null,null,null,null,"FDnetTK:  FDnet Trennerkennzahl (Isolator index); separator connection factor: devices with separator = 1, without separator = 0"]
[null,null,"Stub1_1 ",null,"Stub1_2",null,"Stub2_1 ",null,"Stub2_2",null,"Stub3_1 ",null,"Stub3_2",null,"Stub4_1 ",null,"Stub4_2",null,null,null,"Internal AI: Device has an internal AI"]
[null,null,true,null,true,null,true,null,true,null,true,null,true,null,true,null,true,null,null,null,"Constant Current: Device consumes current independent from device voltage"]
[null,null,null,null,null,null,null,null,null,null,null,null,null,null,null,null,null,null,null,null,"Constant Power: Device consumes current regulated by device voltage"]
[null,"Selection Card (Normal, PowerBus)",null,null,null,null,null,null,null,null,null,null,null,null,null,null,null,null,null,null,"Low ohmic FET: Device has an low ohmic isolator FET"]
[null,1,"Selection card",null,null,null,null,null,null,null,null,null,null,null,null,null,null,null,null,null,"16V min. device voltage: Device need  at min. 16V"]
[]
[]
[]
[null,"Alarm indicator extras"]
[null,"Alarm Indicator extras"]
[null,"None","Alarm Indicator extras"]
[null,5.3333333333333332E-3,"Alarm Indicator Current [A]"]
[null,4.0000000000000002E-4,"Alarm Indicator Current Ex-Line [A]"]
[]
[]
[null,"Choose max. Line current"]
[null,"Choose Current"]
[null,"0.5A","Chosen card current"]
[]
[]
[]
[null,"ExtensionView"]
[null,true]
[null,"Ext. changable"]
[null,true]
[null,"Loop2 visible"]
[null,true]
[null,"Device Population","Line card (C-NET) FCL2001-A1",null,null,null,null,null,null,null,null,null,null,null,null,null,null,null,null,null,"FDnetRK",null,null,"FDnetMK"]
[null,null,null,null,null,null,null,null,null,null,null,null,null,null,null,null,null,null,null,null,"Total","Constant",null,"Total","Constant"]
[null,null,"Stub1_1",null,"Stub1_2",null,"Stub2_1",null,"Stub2_2",null,"Stub3_1",null,"Stub3_2",null,"Stub4_1",null,"Stub4_2",null,null,null,null,"Current","Power",null,"Current","Power","FDnetTK","FDnetAK","Internal AI","Low ohmic FET","16V min. device voltage","Remarks"]
[null,"Point detectors",null,null,null,null,null,null,null,null,null,null,null,null,null,null,null,null,null,null,null,"Constant Current",null,null,"constant power",null,null,null,null,null,null,"Point detectors"]
[null,"OP720 - Smoke detector",0,"pcs.",0,"pcs.",0,"pcs.",0,"pcs.",0,"pcs.",0,"pcs.",0,"pcs.",0,"pcs.",null,null,{"$f":"V84+W84","v":1},1,0,{"$f":"Y84+Z84","v":1},1,0,1,1,1,0,0,{"$f":"B84","v":"OP720 - Smoke detector"}]
[null,"HI722 - Heat detector",0,"pcs.",0,"pcs.",0,"pcs.",0,"pcs.",0,"pcs.",0,"pcs.",0,"pcs.",0,"pcs.",null,null,{"$f":"V85+W85","v":1},1,0,{"$f":"Y85+Z85","v":1},1,0,1,1,1,0,0,"HI722 - Heat detector"]
[null,"HI720 - Heat detector",0,"pcs.",0,"pcs.",0,"pcs.",0,"pcs.",0,"pcs.",0,"pcs.",0,"pcs.",0,"pcs.",null,null,1,1,0,1,1,0,1,1,1,0,0,"HI720 - Heat detector"]
[null,"OH720 - Multi Sensor detector",0,"pcs.",0,"pcs.",0,"pcs.",0,"pcs.",0,"pcs.",0,"pcs.",0,"pcs.",0,"pcs.",null,null,1,1,0,1,1,0,1,1,1,0,0,"OH720 - Multi Sensor detector"]
[null,"OOH740 - Multi Sensor detector",0,"pcs.",0,"pcs.",0,"pcs.",0,"pcs.",0,"pcs.",0,"pcs.",0,"pcs.",0,"pcs.",null,null,1,1,0,1,1,0,1,1,1,0,0,"OOH740 - Multi Sensor detector"]
[]
[null,null,null,null,null,null,null,null,null,null,null,null,null,null,null,null,null,null,null,null,0,null,null,0,null,null,null,null,null,null,null,0]
[null,null,null,null,null,null,null,null,null,null,null,null,null,null,null,null,null,null,null,null,0,null,null,0,null,null,null,null,null,null,null,0]
[null,null,null,null,null,null,null,null,null,null,null,null,null,null,null,null,null,null,null,null,0,null,null,0,null,null,null,null,null,null,null,0]
[null,null,null,null,null,null,null,null,null,null,null,null,null,null,null,null,null,null,null,null,0,null,null,0,null,null,null,null,null,null,null,0]
[null,null,null,null,null,null,null,null,null,null,null,null,null,null,null,null,null,null,null,null,0,null,null,0,null,null,null,null,null,null,null,0]
[null,null,null,null,null,null,null,null,null,null,null,null,null,null,null,null,null,null,null,null,0,null,null,0,null,null,null,null,null,null,null,0]
[null,null,null,null,null,null,null,null,null,null,null,null,null,null,null,null,null,null,null,null,0,null,null,0,null,null,null,null,null,null,null,0]
[null,null,null,null,null,null,null,null,null,null,null,null,null,null,null,null,null,null,null,null,0,null,null,0,null,null,null,null,null,null,null,0]
[null,null,null,null,null,null,null,null,null,null,null,null,null,null,null,null,null,null,null,null,0,null,null,0,null,null,null,null,null,null,null,0]
[null,null,null,null,null,null,null,null,null,null,null,null,null,null,null,null,null,null,null,null,0,null,null,0,null,null,null,null,null,null,null,0]
[null,"Special detectors",null,null,null,null,null,null,null,null,null,null,null,null,null,null,null,null,null,null,null,null,null,null,null,null,null,null,null,null,null,"Special detectors"]
[null,"FDF221-9 - Infrared flame detector",0,"pcs.",0,"pcs.",0,"pcs.",0,"pcs.",0,"pcs.",0,"pcs.",0,"pcs.",0,"pcs.",null,null,3,3,0,3,3,0,1,1,1,0,0,"FDF221-9 - Infrared flame detector"]
[null,"FDF241-9 - Infrared flame detector",0,"pcs.",0,"pcs.",0,"pcs.",0,"pcs.",0,"pcs.",0,"pcs.",0,"pcs.",0,"pcs.",null,null,3,3,0,3,3,0,1,1,1,0,0,"FDF241-9 - Infrared flame detector"]
[null,"FDL241-9 - Linear smoke detector",0,"pcs.",0,"pcs.",0,"pcs.",0,"pcs.",0,"pcs.",0,"pcs.",0,"pcs.",0,"pcs.",null,null,4,4,0,4,4,0,1,1,1,0,0,"FDL241-9 - Linear smoke detector"]
[null,"OOHC740 - Neural Fire and CO detector",0,"pcs.",0,"pcs.",0,"pcs.",0,"pcs.",0,"pcs.",0,"pcs.",0,"pcs.",0,"pcs.",null,null,2,2,0,2,2,0,1,1,1,0,0,"OOHC740 - Neural Fire and CO detector"]
[null,null,null,null,null,null,null,null,null,null,null,null,null,null,null,null,null,null,null,null,0,null,null,0,null,null,null,null,null,null,null,0]
[null,null,null,null,null,null,null,null,null,null,null,null,null,null,null,null,null,null,null,null,0,null,null,0,null,null,null,null,null,null,null,0]
[null,null,null,null,null,null,null,null,null,null,null,null,null,null,null,null,null,null,null,null,0,null,null,0,null,null,null,null,null,null,null,0]
[null,null,null,null,null,null,null,null,null,null,null,null,null,null,null,null,null,null,null,null,0,null,null,0,null,null,null,null,null,null,null,0]
[null,null,null,null,null,null,null,null,null,null,null,null,null,null,null,null,null,null,null,null,0,null,null,0,null,null,null,null,null,null,null,0]
[null,null,null,null,null,null,null,null,null,null,null,null,null,null,null,null,null,null,null,null,0,null,null,0,null,null,null,null,null,null,null,0]
[null,null,null,null,null,null,null,null,null,null,null,null,null,null,null,null,null,null,null,null,0,null,null,0,null,null,null,null,null,null,null,0]
[null,null,null,null,null,null,null,null,null,null,null,null,null,null,null,null,null,null,null,null,0,null,null,0,null,null,null,null,null,null,null,0]
[null,null,null,null,null,null,null,null,null,null,null,null,null,null,null,null,null,null,null,null,0,null,null,0,null,null,null,null,null,null,null,0]
[null,null,null,null,null,null,null,null,null,null,null,null,null,null,null,null,null,null,null,null,0,null,null,0,null,null,null,null,null,null,null,0]
[null,"Manual call points",null,null,null,null,null,null,null,null,null,null,null,null,null,null,null,null,null,null,null,null,null,null,null,null,null,null,null,null,null,"Manual call points"]
[null,"FDM22x - Manual call points",0,"pcs.",0,"pcs.",0,"pcs.",0,"pcs.",0,"pcs.",0,"pcs.",0,"pcs.",0,"pcs.",null,null,1,1,0,1,1,0,1,1,1,0,0,"FDM22x - Manual call points"]
[null,null,null,null,null,null,null,null,null,null,null,null,null,null,null,null,null,null,null,null,0,null,null,0,null,null,null,null,null,null,null,0]
[null,null,null,null,null,null,null,null,null,null,null,null,null,null,null,null,null,null,null,null,0,null,null,0,null,null,null,null,null,null,null,0]
[null,null,null,null,null,null,null,null,null,null,null,null,null,null,null,null,null,null,null,null,0,null,null,0,null,null,null,null,null,null,null,0]
[null,null,null,null,null,null,null,null,null,null,null,null,null,null,null,null,null,null,null,null,0,null,null,0,null,null,null,null,null,null,null,0]
[null,null,null,null,null,null,null,null,null,null,null,null,null,null,null,null,null,null,null,null,0,null,null,0,null,null,null,null,null,null,null,0]
[null,null,null,null,null,null,null,null,null,null,null,null,null,null,null,null,null,null,null,null,0,null,null,0,null,null,null,null,null,null,null,0]
[null,null,null,null,null,null,null,null,null,null,null,null,null,null,null,null,null,null,null,null,0,null,null,0,null,null,null,null,null,null,null,0]
[null,null,null,null,null,null,null,null,null,null,null,null,null,null,null,null,null,null,null,null,0,null,null,0,null,null,null,null,null,null,null,0]
[null,null,null,null,null,null,null,null,null,null,null,null,null,null,null,null,null,null,null,null,0,null,null,0,null,null,null,null,null,null,null,0]
[null,null,null,null,null,null,null,null,null,null,null,null,null,null,null,null,null,null,null,null,0,null,null,0,null,null,null,null,null,null,null,0]
[null,"Line modules",null,null,null,null,null,null,null,null,null,null,null,null,null,null,null,null,null,null,null,null,null,null,null,null,null,null,null,null,null,"Line modules"]
[null,"FDCI221 - Input module (1I)",0,"pcs.",0,"pcs.",0,"pcs.",0,"pcs.",0,"pcs.",0,"pcs.",0,"pcs.",0,"pcs.",null,null,2,2,0,2,2,0,1,1,0,0,0,"FDCI221 - Input module (1I)"]
[null,"FDCI222 - Input module (4I)",0,"pcs.",0,"pcs.",0,"pcs.",0,"pcs.",0,"pcs.",0,"pcs.",0,"pcs.",0,"pcs.",null,null,2,2,0,2,2,0,1,1,0,0,0,"FDCI222 - Input module (4I)"]
[null,"FDCIO221 - In/Output module (1I&1O)",0,"pcs.",0,"pcs.",0,"pcs.",0,"pcs.",0,"pcs.",0,"pcs.",0,"pcs.",0,"pcs.",null,null,2,2,0,2,2,0,1,1,0,0,0,"FDCIO221 - In/Output module (1I&1O)"]
[null,"FDCIO222 - In/Output module (4I&4O)",0,"pcs.",0,"pcs.",0,"pcs.",0,"pcs.",0,"pcs.",0,"pcs.",0,"pcs.",0,"pcs.",null,null,3,3,0,3,3,0,1,1,0,0,0,"FDCIO222 - In/Output module (4I&4O)"]
[null,"FDCIO223 - In/Output module (2I/O)",0,"pcs.",0,"pcs.",0,"pcs.",0,"pcs.",0,"pcs.",0,"pcs.",0,"pcs.",0,"pcs.",null,null,3,3,0,3,3,0,1,1,0,0,0,"FDCIO223 - In/Output module (2I/O)"]
[null,"FDCIO224 - In/Output module (4I&4O)",0,"pcs.",0,"pcs.",0,"pcs.",0,"pcs.",0,"pcs.",0,"pcs.",0,"pcs.",0,"pcs.",null,null,3,3,0,3,3,0,1,1,0,0,0,"FDCIO224 - In/Output module (4I&4O)"]
[null,"FDCL221 - Line isolator",0,"pcs.",0,"pcs.",0,"pcs.",0,"pcs.",0,"pcs.",0,"pcs.",0,"pcs.",0,"pcs.",null,null,1,1,0,1,1,0,1,1,0,0,0,"FDCL221 - Line isolator"]
[null,"FDCL221-M - Multi line isolator",0,"pcs.",0,"pcs.",0,"pcs.",0,"pcs.",0,"pcs.",0,"pcs.",0,"pcs.",0,"pcs.",null,null,9,9,0,9,9,0,9,9,0,0,0,"FDCL221-M - Multi line isolator"]
[null,"FDCI223 - Zone module, external powered",0,"pcs.",0,"pcs.",0,"pcs.",0,"pcs.",0,"pcs.",0,"pcs.",0,"pcs.",0,"pcs.",null,null,3,3,0,3,3,0,1,1,0,0,0,{"$f":"B136","v":"FDCI223 - Zone module, external powered"}]
[null,null,null,null,null,null,null,null,null,null,null,null,null,null,null,null,null,null,null,null,null,null,null,null,null,null,null,null,null,null,null,0]
[null,null,null,null,null,null,null,null,null,null,null,null,null,null,null,null,null,null,null,null,null,null,null,null,null,null,null,null,null,null,null,0]
[null,null,null,null,null,null,null,null,null,null,null,null,null,null,null,null,null,null,null,null,null,null,null,null,null,null,null,null,null,null,null,0]
[null,null,null,null,null,null,null,null,null,null,null,null,null,null,null,null,null,null,null,null,null,null,null,null,null,null,null,null,null,null,null,0]
[null,null,null,null,null,null,null,null,null,null,null,null,null,null,null,null,null,null,null,null,null,null,null,null,null,null,null,null,null,null,null,0]
[null,null,null,null,null,null,null,null,null,null,null,null,null,null,null,null,null,null,null,null,null,null,null,null,null,null,null,null,null,null,null,0]
[null,null,null,null,null,null,null,null,null,null,null,null,null,null,null,null,null,null,null,null,null,null,null,null,null,null,null,null,null,null,null,0]
[null,null,null,null,null,null,null,null,null,null,null,null,null,null,null,null,null,null,null,null,null,null,null,null,null,null,null,null,null,null,null,0]
[null,null,null,null,null,null,null,null,null,null,null,null,null,null,null,null,null,null,null,null,null,null,null,null,null,null,null,null,null,null,null,0]
[null,"Radio devices",null,null,null,null,null,null,null,null,null,null,null,null,null,null,null,null,null,null,null,null,null,null,null,null,null,null,null,null,null,"Radio devices"]
[null,"FDCW221 - Radio gateway",0,"pcs.",0,"pcs.",0,"pcs.",0,"pcs.",0,"pcs.",0,"pcs.",0,"pcs.",0,"pcs.",null,null,{"$f":"V147+W147","v":4},4,0,{"$f":"Y147+Z147","v":5},5,0,1,2,0,0,0,"FDCW221 - Radio gateway"]
[null,"DOW1171, SMF6120+SMF121 - detectors",0,"pcs.",0,"pcs.",0,"pcs.",0,"pcs.",0,"pcs.",0,"pcs.",0,"pcs.",0,"pcs.",null,null,{"$f":"V148+W148","v":1},1,0,{"$f":"Y148+Z148","v":1},1,0,0,1,0,0,0,{"$f":"B148","v":"DOW1171, SMF6120+SMF121 - detectors"}]
[null,"FDCW241 - SWING gateway",0,"pcs.",0,"pcs.",0,"pcs.",0,"pcs.",0,"pcs.",0,"pcs.",0,"pcs.",0,"pcs.",null,null,{"$f":"V149+W149","v":6},6,0,{"$f":"Y149+Z149","v":16},16,0,1,2,0,0,0,"FDCW241 - SWING gateway"]
[null,"FDOOT271 - SWING Smoke and Heat detector",0,"pcs.",0,"pcs.",0,"pcs.",0,"pcs.",0,"pcs.",0,"pcs.",0,"pcs.",0,"pcs.",null,null,{"$f":"V150+W150","v":0},0,0,{"$f":"Y150+Z150","v":0},0,0,0,1,0,0,0,"FDOOT271 - SWING Smoke and Heat detector"]
[null,"FDM273 - SWING Manual call point",0,"pcs.",0,"pcs.",0,"pcs.",0,"pcs.",0,"pcs.",0,"pcs.",0,"pcs.",0,"pcs.",null,null,{"$f":"V151+W151","v":0},0,0,{"$f":"Y151+Z151","v":0},0,0,0,1,0,0,0,"FDM273 - SWING Manual call point"]
[null,null,null,null,null,null,null,null,null,null,null,null,null,null,null,null,null,null,null,null,null,null,null,null,null,null,null,null,null,null,null,0]
[null,null,null,null,null,null,null,null,null,null,null,null,null,null,null,null,null,null,null,null,null,null,null,null,null,null,null,null,null,null,null,0]
[null,null,null,null,null,null,null,null,null,null,null,null,null,null,null,null,null,null,null,null,null,null,null,null,null,null,null,null,null,null,null,0]
[null,null,null,null,null,null,null,null,null,null,null,null,null,null,null,null,null,null,null,null,null,null,null,null,null,null,null,null,null,null,null,0]
[null,null,null,null,null,null,null,null,null,null,null,null,null,null,null,null,null,null,null,null,null,null,null,null,null,null,null,null,null,null,null,0]
[null,null,null,null,null,null,null,null,null,null,null,null,null,null,null,null,null,null,null,null,null,null,null,null,null,null,null,null,null,null,null,0]
[null,null,null,null,null,null,null,null,null,null,null,null,null,null,null,null,null,null,null,null,null,null,null,null,null,null,null,null,null,null,null,0]
[null,null,null,null,null,null,null,null,null,null,null,null,null,null,null,null,null,null,null,null,null,null,null,null,null,null,null,null,null,null,null,0]
[null,null,null,null,null,null,null,null,null,null,null,null,null,null,null,null,null,null,null,null,null,null,null,null,null,null,null,null,null,null,null,0]
[null,null,null,null,null,null,null,null,null,null,null,null,null,null,null,null,null,null,null,null,null,null,null,null,null,null,null,null,null,null,null,0]
[null,"Integrated modules",null,null,null,null,null,null,null,null,null,null,null,null,null,null,null,null,null,null,null,null,null,null,null,null,null,null,null,null,null,"Integrated modules"]
[null,"VLF 250, VLF 500 - Vesda laser focus (ASD)",0,"pcs.",0,"pcs.",0,"pcs.",0,"pcs.",0,"pcs.",0,"pcs.",0,"pcs.",0,"pcs.",null,null,{"$f":"V163+W163","v":3},3,0,{"$f":"Y163+Z163","v":3},3,0,1,1,0,0,0,"VLF 250, VLF 500 - Vesda laser focus (ASD)"]
[null,"FDA221, FDA241 - Siemens ASD ",0,"pcs.",0,"pcs.",0,"pcs.",0,"pcs.",0,"pcs.",0,"pcs.",0,"pcs.",0,"pcs.",null,null,{"$f":"V164+W164","v":3},3,0,{"$f":"Y164+Z164","v":3},3,0,1,1,0,0,0,"FDA221, FDA241 - Siemens ASD "]
[null,null,null,null,null,null,null,null,null,null,null,null,null,null,null,null,null,null,null,null,null,null,null,null,null,null,null,null,null,null,null,0]
[null,null,null,null,null,null,null,null,null,null,null,null,null,null,null,null,null,null,null,null,null,null,null,null,null,null,null,null,null,null,null,0]
[null,null,null,null,null,null,null,null,null,null,null,null,null,null,null,null,null,null,null,null,null,null,null,null,null,null,null,null,null,null,null,0]
[null,null,null,null,null,null,null,null,null,null,null,null,null,null,null,null,null,null,null,null,null,null,null,null,null,null,null,null,null,null,null,0]
[null,null,null,null,null,null,null,null,null,null,null,null,null,null,null,null,null,null,null,null,null,null,null,null,null,null,null,null,null,null,null,0]
[null,null,null,null,null,null,null,null,null,null,null,null,null,null,null,null,null,null,null,null,null,null,null,null,null,null,null,null,null,null,null,0]
[null,null,null,null,null,null,null,null,null,null,null,null,null,null,null,null,null,null,null,null,null,null,null,null,null,null,null,null,null,null,null,0]
[null,null,null,null,null,null,null,null,null,null,null,null,null,null,null,null,null,null,null,null,null,null,null,null,null,null,null,null,null,null,null,0]
[null,null,null,null,null,null,null,null,null,null,null,null,null,null,null,null,null,null,null,null,null,null,null,null,null,null,null,null,null,null,null,0]
[null,null,null,null,null,null,null,null,null,null,null,null,null,null,null,null,null,null,null,null,null,null,null,null,null,null,null,null,null,null,null,0]
[null,"Alarm devices - Sound",null,null,null,null,null,null,null,null,null,null,null,null,null,null,null,null,null,null,null,null,null,null,null,null,null,null,null,null,null,"Alarm devices - Sound"]
[null,"FDS221-R, FDS221-W - Alarm sounder red or white housing, Sound High",0,"pcs.",0,"pcs.",0,"pcs.",0,"pcs.",0,"pcs.",0,"pcs.",0,"pcs.",0,"pcs.",null,null,{"$f":"V176+W176","v":1},1,0,{"$f":"Y176+Z176","v":15},15,0,1,1,0,0,0,"FDS221-R, FDS221-W - Alarm sounder red or white housing, Sound High"]
[null,"FDS221-R, FDS221-W - Alarm sounder red or white housing, Sound Middle",0,"pcs.",0,"pcs.",0,"pcs.",0,"pcs.",0,"pcs.",0,"pcs.",0,"pcs.",0,"pcs.",null,null,1,1,0,10,10,0,1,1,0,0,0,"FDS221-R, FDS221-W - Alarm sounder red or white housing, Sound Middle"]
[null,"FDS221-R, FDS221-W - Alarm sounder red or white housing, Sound Low",0,"pcs.",0,"pcs.",0,"pcs.",0,"pcs.",0,"pcs.",0,"pcs.",0,"pcs.",0,"pcs.",null,null,1,1,0,5,5,0,1,1,0,0,0,"FDS221-R, FDS221-W - Alarm sounder red or white housing, Sound Low"]
[null,"DBS720 - Sounder base, Sound High",0,"pcs.",0,"pcs.",0,"pcs.",0,"pcs.",0,"pcs.",0,"pcs.",0,"pcs.",0,"pcs.",null,null,0.5,0.5,0,5,5,0,0,0,0,0,0,"DBS720 - Sounder base, Sound High"]
[null,"DBS721 - Sounder interbase, Sound High",0,"pcs.",0,"pcs.",0,"pcs.",0,"pcs.",0,"pcs.",0,"pcs.",0,"pcs.",0,"pcs.",null,null,1,1,0,15,15,0,1,1,0,0,0,"DBS721 - Sounder interbase, Sound High"]
[null,"DBS721 - Sounder interbase, Sound Middle",0,"pcs.",0,"pcs.",0,"pcs.",0,"pcs.",0,"pcs.",0,"pcs.",0,"pcs.",0,"pcs.",null,null,1,1,0,10,10,0,1,1,0,0,0,"DBS721 - Sounder interbase, Sound Middle"]
[null,"DBS721 - Sounder interbase, Sound Low",0,"pcs.",0,"pcs.",0,"pcs.",0,"pcs.",0,"pcs.",0,"pcs.",0,"pcs.",0,"pcs.",null,null,1,1,0,5,5,0,1,1,0,0,0,"DBS721 - Sounder interbase, Sound Low"]
[null,"FDS224-R, FDS224-W - Sounder red or white housing, Sound High",0,"pcs.",0,"pcs.",0,"pcs.",0,"pcs.",0,"pcs.",0,"pcs.",0,"pcs.",0,"pcs.",null,null,1,1,0,15,15,0,1,1,0,1,0,"FDS224-R, FDS224-W - Sounder red or white housing, Sound High"]
[null,"FDS224-R, FDS224-W - Sounder red or white housing, Sound Middle",0,"pcs.",0,"pcs.",0,"pcs.",0,"pcs.",0,"pcs.",0,"pcs.",0,"pcs.",0,"pcs.",null,null,1,1,0,8,8,0,1,1,0,1,0,"FDS224-R, FDS224-W - Sounder red or white housing, Sound Middle"]
[null,"FDS224-R, FDS224-W - Sounder red or white housing, Sound Low",0,"pcs.",0,"pcs.",0,"pcs.",0,"pcs.",0,"pcs.",0,"pcs.",0,"pcs.",0,"pcs.",null,null,1,1,0,6,6,0,1,1,0,1,0,"FDS224-R, FDS224-W - Sounder red or white housing, Sound Low"]
[null,null,null,null,null,null,null,null,null,null,null,null,null,null,null,null,null,null,null,null,null,null,null,null,null,null,null,null,null,null,null,0]
[null,null,null,null,null,null,null,null,null,null,null,null,null,null,null,null,null,null,null,null,null,null,null,null,null,null,null,null,null,null,null,0]
[null,null,null,null,null,null,null,null,null,null,null,null,null,null,null,null,null,null,null,null,null,null,null,null,null,null,null,null,null,null,null,0]
[null,null,null,null,null,null,null,null,null,null,null,null,null,null,null,null,null,null,null,null,null,null,null,null,null,null,null,null,null,null,null,0]
[null,null,null,null,null,null,null,null,null,null,null,null,null,null,null,null,null,null,null,null,null,null,null,null,null,null,null,null,null,null,null,0]
[null,null,null,null,null,null,null,null,null,null,null,null,null,null,null,null,null,null,null,null,null,null,null,null,null,null,null,null,null,null,null,0]
[null,null,null,null,null,null,null,null,null,null,null,null,null,null,null,null,null,null,null,null,null,null,null,null,null,null,null,null,null,null,null,0]
[null,null,null,null,null,null,null,null,null,null,null,null,null,null,null,null,null,null,null,null,null,null,null,null,null,null,null,null,null,null,null,0]
[null,null,null,null,null,null,null,null,null,null,null,null,null,null,null,null,null,null,null,null,null,null,null,null,null,null,null,null,null,null,null,0]
[null,null,null,null,null,null,null,null,null,null,null,null,null,null,null,null,null,null,null,null,null,null,null,null,null,null,null,null,null,null,null,0]
[null,"Alarm devices - Sound and Voice",null,null,null,null,null,null,null,null,null,null,null,null,null,null,null,null,null,null,null,null,null,null,null,null,null,null,null,null,null,"Alarm devices - Sound and Voice"]
[null,"FDS225-R, FDS225-W - Voice sounder red or white housing, Sound High",0,"pcs.",0,"pcs.",0,"pcs.",0,"pcs.",0,"pcs.",0,"pcs.",0,"pcs.",0,"pcs.",null,null,{"$f":"V197+W197","v":1},1,0,{"$f":"Y197+Z197","v":18},18,0,1,1,0,1,0,"FDS225-R, FDS225-W - Voice sounder red or white housing, Sound High"]
[null,"FDS225-R, FDS225-W - Voice sounder red or white housing, Sound Middle",0,"pcs.",0,"pcs.",0,"pcs.",0,"pcs.",0,"pcs.",0,"pcs.",0,"pcs.",0,"pcs.",null,null,1,1,0,13,13,0,1,1,0,1,0,"FDS225-R, FDS225-W - Voice sounder red or white housing, Sound Middle"]
[null,"FDS225-R, FDS225-W - Voice sounder red or white housing, Sound Low",0,"pcs.",0,"pcs.",0,"pcs.",0,"pcs.",0,"pcs.",0,"pcs.",0,"pcs.",0,"pcs.",null,null,1,1,0,12,12,0,1,1,0,1,0,"FDS225-R, FDS225-W - Voice sounder red or white housing, Sound Low"]
[null,"FDS226, FDS227 - Sounders used without beacon functionality, Sound High",0,"pcs.",0,"pcs.",0,"pcs.",0,"pcs.",0,"pcs.",0,"pcs.",0,"pcs.",0,"pcs.",null,null,1.25,1.25,0,18,18,0,1,1,0,1,0,"FDS226, FDS227 - Sounders used without beacon functionality, Sound High"]
[null,"FDS226, FDS227 - Sounders used without beacon functionality, Sound Middle",0,"pcs.",0,"pcs.",0,"pcs.",0,"pcs.",0,"pcs.",0,"pcs.",0,"pcs.",0,"pcs.",null,null,1.25,1.25,0,13,13,0,1,1,0,1,0,"FDS226, FDS227 - Sounders used without beacon functionality, Sound Middle"]
[null,"FDS226, FDS227 - Sounders used without beacon functionality, Sound Low",0,"pcs.",0,"pcs.",0,"pcs.",0,"pcs.",0,"pcs.",0,"pcs.",0,"pcs.",0,"pcs.",null,null,1.25,1.25,0,12,12,0,1,1,0,1,0,"FDS226, FDS227 - Sounders used without beacon functionality, Sound Low"]
[null,null,null,null,null,null,null,null,null,null,null,null,null,null,null,null,null,null,null,null,null,null,null,null,null,null,null,null,null,null,null,0]
[null,null,null,null,null,null,null,null,null,null,null,null,null,null,null,null,null,null,null,null,null,null,null,null,null,null,null,null,null,null,null,0]
[null,null,null,null,null,null,null,null,null,null,null,null,null,null,null,null,null,null,null,null,null,null,null,null,null,null,null,null,null,null,null,0]
[null,null,null,null,null,null,null,null,null,null,null,null,null,null,null,null,null,null,null,null,null,null,null,null,null,null,null,null,null,null,null,0]
[null,null,null,null,null,null,null,null,null,null,null,null,null,null,null,null,null,null,null,null,null,null,null,null,null,null,null,null,null,null,null,0]
[null,null,null,null,null,null,null,null,null,null,null,null,null,null,null,null,null,null,null,null,null,null,null,null,null,null,null,null,null,null,null,0]
[null,null,null,null,null,null,null,null,null,null,null,null,null,null,null,null,null,null,null,null,null,null,null,null,null,null,null,null,null,null,null,0]
[null,null,null,null,null,null,null,null,null,null,null,null,null,null,null,null,null,null,null,null,null,null,null,null,null,null,null,null,null,null,null,0]
[null,null,null,null,null,null,null,null,null,null,null,null,null,null,null,null,null,null,null,null,null,null,null,null,null,null,null,null,null,null,null,0]
[null,null,null,null,null,null,null,null,null,null,null,null,null,null,null,null,null,null,null,null,null,null,null,null,null,null,null,null,null,null,null,{"$f":"B212","v":0}]
[null,"Alarm devices - Sound and Light (Beacon)",null,null,null,null,null,null,null,null,null,null,null,null,null,null,null,null,null,null,null,null,null,null,null,null,null,null,null,null,null,"Alarm devices - Sound and Light (Beacon)"]
[null,"FDS229-A, FDS229-R - Alarm sounder and beacon, amber or red, Light and Sound High",0,"pcs.",0,"pcs.",0,"pcs.",0,"pcs.",0,"pcs.",0,"pcs.",0,"pcs.",0,"pcs.",null,null,{"$f":"V214+W214","v":1},1,0,{"$f":"Y214+Z214","v":30},30,0,1,1,0,0,0,"FDS229-A, FDS229-R - Alarm sounder and beacon, amber or red, Light and Sound High"]
[null,"FDS229-A, FDS229-R - Alarm sounder and beacon, amber or red, Light and Sound Middle",0,"pcs.",0,"pcs.",0,"pcs.",0,"pcs.",0,"pcs.",0,"pcs.",0,"pcs.",0,"pcs.",null,null,1,1,0,20,20,0,1,1,0,0,0,"FDS229-A, FDS229-R - Alarm sounder and beacon, amber or red, Light and Sound Middle"]
[null,"FDS229-A, FDS229-R - Alarm sounder and beacon, amber or red, Light and Sound Low",0,"pcs.",0,"pcs.",0,"pcs.",0,"pcs.",0,"pcs.",0,"pcs.",0,"pcs.",0,"pcs.",null,null,1,1,0,10,10,0,1,1,0,0,0,"FDS229-A, FDS229-R - Alarm sounder and beacon, amber or red, Light and Sound Low"]
[null,"FDS226 - Sounder beacon, Red Light, High Intensity",0,"pcs.",0,"pcs.",0,"pcs.",0,"pcs.",0,"pcs.",0,"pcs.",0,"pcs.",0,"pcs.",null,null,1.25,1.25,0,111,22,89,1,1,0,1,1,"FDS226 - Sounder beacon, Red Light, High Intensity"]
[null,"FDS226 - Sounder beacon, Red Light, Middle Intensity",0,"pcs.",0,"pcs.",0,"pcs.",0,"pcs.",0,"pcs.",0,"pcs.",0,"pcs.",0,"pcs.",null,null,1.25,1.25,0,80,22,58,1,1,0,1,1,"FDS226 - Sounder beacon, Red Light, Middle Intensity"]
[null,"FDS226 - Sounder beacon, Red Light, Low Intensity",0,"pcs.",0,"pcs.",0,"pcs.",0,"pcs.",0,"pcs.",0,"pcs.",0,"pcs.",0,"pcs.",null,null,1.25,1.25,0,64,22,42,1,1,0,1,1,"FDS226 - Sounder beacon, Red Light, Low Intensity"]
[null,"FDS226 - Sounder beacon, Red Light, Indicator Mode",0,"pcs.",0,"pcs.",0,"pcs.",0,"pcs.",0,"pcs.",0,"pcs.",0,"pcs.",0,"pcs.",null,null,1.25,1.25,0,30,22,8,1,1,0,1,0,"FDS226 - Sounder beacon, Red Light, Indicator Mode"]
[null,"FDS226 - Sounder beacon, White Light, High Intensity",0,"pcs.",0,"pcs.",0,"pcs.",0,"pcs.",0,"pcs.",0,"pcs.",0,"pcs.",0,"pcs.",null,null,1.25,1.25,0,108,22,86,1,1,0,1,1,"FDS226 - Sounder beacon, White Light, High Intensity"]
[null,"FDS226 - Sounder beacon, White Light, Middle Intensity",0,"pcs.",0,"pcs.",0,"pcs.",0,"pcs.",0,"pcs.",0,"pcs.",0,"pcs.",0,"pcs.",null,null,1.25,1.25,0,62,22,40,1,1,0,1,1,"FDS226 - Sounder beacon, White Light, Middle Intensity"]
[null,"FDS226 - Sounder beacon, White Light, Low Intensity",0,"pcs.",0,"pcs.",0,"pcs.",0,"pcs.",0,"pcs.",0,"pcs.",0,"pcs.",0,"pcs.",null,null,1.25,1.25,0,51,22,29,1,1,0,1,1,"FDS226 - Sounder beacon, White Light, Low Intensity"]
[null,"FDS226 - Sounder beacon, White Light, Indicator Mode",0,"pcs.",0,"pcs.",0,"pcs.",0,"pcs.",0,"pcs.",0,"pcs.",0,"pcs.",0,"pcs.",null,null,1.25,1.25,0,30,22,8,1,1,0,1,0,"FDS226 - Sounder beacon, White Light, Indicator Mode"]
[null,"FDSB226 - Sounder beacon base, Red Light, High Intensity",0,"pcs.",0,"pcs.",0,"pcs.",0,"pcs.",0,"pcs.",0,"pcs.",0,"pcs.",0,"pcs.",null,null,1.25,1.25,0,116,23,93,1,1,0,1,1,"FDSB226 - Sounder beacon base, Red Light, High Intensity"]
[null,"FDSB226 - Sounder beacon base, Red Light, Middle Intensity",0,"pcs.",0,"pcs.",0,"pcs.",0,"pcs.",0,"pcs.",0,"pcs.",0,"pcs.",0,"pcs.",null,null,1.25,1.25,0,88,23,65,1,1,0,1,1,"FDSB226 - Sounder beacon base, Red Light, Middle Intensity"]
[null,"FDSB226 - Sounder beacon base, Red Light, Low Intensity",0,"pcs.",0,"pcs.",0,"pcs.",0,"pcs.",0,"pcs.",0,"pcs.",0,"pcs.",0,"pcs.",null,null,1.25,1.25,0,60,23,37,1,1,0,1,1,"FDSB226 - Sounder beacon base, Red Light, Low Intensity"]
[null,"FDSB226 - Sounder beacon base, Red Light, Indicator Mode",0,"pcs.",0,"pcs.",0,"pcs.",0,"pcs.",0,"pcs.",0,"pcs.",0,"pcs.",0,"pcs.",null,null,1.25,1.25,0,31,23,8,1,1,0,1,0,"FDSB226 - Sounder beacon base, Red Light, Indicator Mode"]
[null,"FDSB226 - Sounder beacon base, White Light, High Intensity",0,"pcs.",0,"pcs.",0,"pcs.",0,"pcs.",0,"pcs.",0,"pcs.",0,"pcs.",0,"pcs.",null,null,1.25,1.25,0,132,23,109,1,1,0,1,1,"FDSB226 - Sounder beacon base, White Light, High Intensity"]
[null,"FDSB226 - Sounder beacon base, White Light, Middle Intensity",0,"pcs.",0,"pcs.",0,"pcs.",0,"pcs.",0,"pcs.",0,"pcs.",0,"pcs.",0,"pcs.",null,null,1.25,1.25,0,82,23,59,1,1,0,1,1,"FDSB226 - Sounder beacon base, White Light, Middle Intensity"]
[null,"FDSB226 - Sounder beacon base, White Light, Low Intensity",0,"pcs.",0,"pcs.",0,"pcs.",0,"pcs.",0,"pcs.",0,"pcs.",0,"pcs.",0,"pcs.",null,null,1.25,1.25,0,49,23,26,1,1,0,1,1,"FDSB226 - Sounder beacon base, White Light, Low Intensity"]
[null,"FDSB226 - Sounder beacon base, White Light, Indicator Mode",0,"pcs.",0,"pcs.",0,"pcs.",0,"pcs.",0,"pcs.",0,"pcs.",0,"pcs.",0,"pcs.",null,null,1.25,1.25,0,31,23,8,1,1,0,1,0,"FDSB226 - Sounder beacon base, White Light, Indicator Mode"]
[null,"DBS728 - Sounder beacon interbase, Sound and Light High",0,"pcs.",0,"pcs.",0,"pcs.",0,"pcs.",0,"pcs.",0,"pcs.",0,"pcs.",0,"pcs.",null,null,1,1,0,40,40,0,1,1,0,0,0,"DBS728 - Sounder beacon interbase, Sound and Light High"]
[null,"DBS728 - Sounder beacon interbase, Sound and Light Low",0,"pcs.",0,"pcs.",0,"pcs.",0,"pcs.",0,"pcs.",0,"pcs.",0,"pcs.",0,"pcs.",null,null,1,1,0,23,23,0,1,1,0,0,0,"DBS728 - Sounder beacon interbase, Sound and Light Low"]
[null,"DBS728 - Sounder beacon interbase, Sound Only",0,"pcs.",0,"pcs.",0,"pcs.",0,"pcs.",0,"pcs.",0,"pcs.",0,"pcs.",0,"pcs.",null,null,1,1,0,15,15,0,1,1,0,0,0,"DBS728 - Sounder beacon interbase, Sound Only"]
[null,"DBS729 - Sounder beacon interbase, Sound and Light High",0,"pcs.",0,"pcs.",0,"pcs.",0,"pcs.",0,"pcs.",0,"pcs.",0,"pcs.",0,"pcs.",null,null,1,1,0,41,41,0,1,1,0,0,0,"DBS729 - Sounder beacon interbase, Sound and Light High"]
[null,"DBS729 - Sounder beacon interbase, Sound and Light Mid",0,"pcs.",0,"pcs.",0,"pcs.",0,"pcs.",0,"pcs.",0,"pcs.",0,"pcs.",0,"pcs.",null,null,1,1,0,30,30,0,1,1,0,0,0,"DBS729 - Sounder beacon interbase, Sound and Light Mid"]
[null,"DBS729 - Sounder beacon interbase, Sound and Light Low",0,"pcs.",0,"pcs.",0,"pcs.",0,"pcs.",0,"pcs.",0,"pcs.",0,"pcs.",0,"pcs.",null,null,1,1,0,20,20,0,1,1,0,0,0,"DBS729 - Sounder beacon interbase, Sound and Light Low"]
[null,"DBS729 - Sounder beacon interbase, Sound Only",0,"pcs.",0,"pcs.",0,"pcs.",0,"pcs.",0,"pcs.",0,"pcs.",0,"pcs.",0,"pcs.",null,null,1,1,0,15,15,0,1,1,0,0,0,"DBS729 - Sounder beacon interbase, Sound Only"]
[null,null,null,null,null,null,null,null,null,null,null,null,null,null,null,null,null,null,null,null,null,null,null,null,null,null,null,null,null,null,null,0]
[null,null,null,null,null,null,null,null,null,null,null,null,null,null,null,null,null,null,null,null,null,null,null,null,null,null,null,null,null,null,null,0]
[null,null,null,null,null,null,null,null,null,null,null,null,null,null,null,null,null,null,null,null,null,null,null,null,null,null,null,null,null,null,null,0]
[null,null,null,null,null,null,null,null,null,null,null,null,null,null,null,null,null,null,null,null,null,null,null,null,null,null,null,null,null,null,null,0]
[null,null,null,null,null,null,null,null,null,null,null,null,null,null,null,null,null,null,null,null,null,null,null,null,null,null,null,null,null,null,null,{"$f":"B244","v":0}]
[null,null,null,null,null,null,null,null,null,null,null,null,null,null,null,null,null,null,null,null,null,null,null,null,null,null,null,null,null,null,null,0]
[null,null,null,null,null,null,null,null,null,null,null,null,null,null,null,null,null,null,null,null,null,null,null,null,null,null,null,null,null,null,null,0]
[null,null,null,null,null,null,null,null,null,null,null,null,null,null,null,null,null,null,null,null,null,null,null,null,null,null,null,null,null,null,null,0]
[null,null,null,null,null,null,null,null,null,null,null,null,null,null,null,null,null,null,null,null,null,null,null,null,null,null,null,null,null,null,null,0]
[null,null,null,null,null,null,null,null,null,null,null,null,null,null,null,null,null,null,null,null,null,null,null,null,null,null,null,null,null,null,null,0]
[null,"Alarm devices - Sound and Voice and Light (Beacon)",null,null,null,null,null,null,null,null,null,null,null,null,null,null,null,null,null,null,null,null,null,null,null,null,null,null,null,null,null,"Alarm devices - Sound and Voice and Light (Beacon)"]
[null,"FDS227 - Voice sounder beacon, Red Light, High Intensity",0,"pcs.",0,"pcs.",0,"pcs.",0,"pcs.",0,"pcs.",0,"pcs.",0,"pcs.",0,"pcs.",null,null,{"$f":"V251+W251","v":1.25},1.25,0,{"$f":"Y251+Z251","v":111},23,88,1,1,0,1,1,"FDS227 - Voice sounder beacon, Red Light, High Intensity"]
[null,"FDS227 - Voice sounder beacon, Red Light, Middle Intensity",0,"pcs.",0,"pcs.",0,"pcs.",0,"pcs.",0,"pcs.",0,"pcs.",0,"pcs.",0,"pcs.",null,null,1.25,1.25,0,81,23,58,1,1,0,1,1,"FDS227 - Voice sounder beacon, Red Light, Middle Intensity"]
[null,"FDS227 - Voice sounder beacon, Red Light, Low Intensity",0,"pcs.",0,"pcs.",0,"pcs.",0,"pcs.",0,"pcs.",0,"pcs.",0,"pcs.",0,"pcs.",null,null,1.25,1.25,0,65,23,42,1,1,0,1,1,"FDS227 - Voice sounder beacon, Red Light, Low Intensity"]
[null,"FDS227 - Voice sounder beacon, Red Light, Indicator Mode",0,"pcs.",0,"pcs.",0,"pcs.",0,"pcs.",0,"pcs.",0,"pcs.",0,"pcs.",0,"pcs.",null,null,1.25,1.25,0,32,23,9,1,1,0,1,0,"FDS227 - Voice sounder beacon, Red Light, Indicator Mode"]
[null,"FDS227 - Voice sounder beacon, White Light, High Intensity",0,"pcs.",0,"pcs.",0,"pcs.",0,"pcs.",0,"pcs.",0,"pcs.",0,"pcs.",0,"pcs.",null,null,1.25,1.25,0,110,23,87,1,1,0,1,1,"FDS227 - Voice sounder beacon, White Light, High Intensity"]
[null,"FDS227 - Voice sounder beacon, White Light, Middle Intensity",0,"pcs.",0,"pcs.",0,"pcs.",0,"pcs.",0,"pcs.",0,"pcs.",0,"pcs.",0,"pcs.",null,null,1.25,1.25,0,63,23,40,1,1,0,1,1,"FDS227 - Voice sounder beacon, White Light, Middle Intensity"]
[null,"FDS227 - Voice sounder beacon, White Light, Low Intensity",0,"pcs.",0,"pcs.",0,"pcs.",0,"pcs.",0,"pcs.",0,"pcs.",0,"pcs.",0,"pcs.",null,null,1.25,1.25,0,52,23,29,1,1,0,1,1,"FDS227 - Voice sounder beacon, White Light, Low Intensity"]
[null,"FDS227 - Voice sounder beacon, White Light, Indicator Mode",0,"pcs.",0,"pcs.",0,"pcs.",0,"pcs.",0,"pcs.",0,"pcs.",0,"pcs.",0,"pcs.",null,null,1.25,1.25,0,32,23,9,1,1,0,1,0,"FDS227 - Voice sounder beacon, White Light, Indicator Mode"]
[null,"FDSB227 - Voice sounder beacon base, Red Light, High Intensity",0,"pcs.",0,"pcs.",0,"pcs.",0,"pcs.",0,"pcs.",0,"pcs.",0,"pcs.",0,"pcs.",null,null,1.25,1.25,0,116,24,92,1,1,0,1,1,"FDSB227 - Voice sounder beacon base, Red Light, High Intensity"]
[null,"FDSB227 - Voice sounder beacon base, Red Light, Middle Intensity",0,"pcs.",0,"pcs.",0,"pcs.",0,"pcs.",0,"pcs.",0,"pcs.",0,"pcs.",0,"pcs.",null,null,1.25,1.25,0,88,24,64,1,1,0,1,1,"FDSB227 - Voice sounder beacon base, Red Light, Middle Intensity"]
[null,"FDSB227 - Voice sounder beacon base, Red Light, Low Intensity",0,"pcs.",0,"pcs.",0,"pcs.",0,"pcs.",0,"pcs.",0,"pcs.",0,"pcs.",0,"pcs.",null,null,1.25,1.25,0,61,24,37,1,1,0,1,1,"FDSB227 - Voice sounder beacon base, Red Light, Low Intensity"]
[null,"FDSB227 - Voice sounder beacon base, Red Light, Indicator Mode",0,"pcs.",0,"pcs.",0,"pcs.",0,"pcs.",0,"pcs.",0,"pcs.",0,"pcs.",0,"pcs.",null,null,1.25,1.25,0,33,24,9,1,1,0,1,0,"FDSB227 - Voice sounder beacon base, Red Light, Indicator Mode"]
[null,"FDSB227 - Voice sounder beacon base, White Light, High Intensity",0,"pcs.",0,"pcs.",0,"pcs.",0,"pcs.",0,"pcs.",0,"pcs.",0,"pcs.",0,"pcs.",null,null,1.25,1.25,0,133,24,109,1,1,0,1,1,"FDSB227 - Voice sounder beacon base, White Light, High Intensity"]
[null,"FDSB227 - Voice sounder beacon base, White Light, Middle Intensity",0,"pcs.",0,"pcs.",0,"pcs.",0,"pcs.",0,"pcs.",0,"pcs.",0,"pcs.",0,"pcs.",null,null,1.25,1.25,0,83,24,59,1,1,0,1,1,"FDSB227 - Voice sounder beacon base, White Light, Middle Intensity"]
[null,"FDSB227 - Voice sounder beacon base, White Light, Low Intensity",0,"pcs.",0,"pcs.",0,"pcs.",0,"pcs.",0,"pcs.",0,"pcs.",0,"pcs.",0,"pcs.",null,null,1.25,1.25,0,50,24,26,1,1,0,1,1,"FDSB227 - Voice sounder beacon base, White Light, Low Intensity"]
[null,"FDSB227 - Voice sounder beacon base, White Light, Indicator Mode",0,"pcs.",0,"pcs.",0,"pcs.",0,"pcs.",0,"pcs.",0,"pcs.",0,"pcs.",0,"pcs.",null,null,1.25,1.25,0,33,24,9,1,1,0,1,0,"FDSB227 - Voice sounder beacon base, White Light, Indicator Mode"]
[null,null,null,null,null,null,null,null,null,null,null,null,null,null,null,null,null,null,null,null,null,null,null,null,null,null,null,null,null,null,null,0]
[null,null,null,null,null,null,null,null,null,null,null,null,null,null,null,null,null,null,null,null,null,null,null,null,null,null,null,null,null,null,null,0]
[null,null,null,null,null,null,null,null,null,null,null,null,null,null,null,null,null,null,null,null,null,null,null,null,null,null,null,null,null,null,null,0]
[null,null,null,null,null,null,null,null,null,null,null,null,null,null,null,null,null,null,null,null,null,null,null,null,null,null,null,null,null,null,null,0]
[null,null,null,null,null,null,null,null,null,null,null,null,null,null,null,null,null,null,null,null,null,null,null,null,null,null,null,null,null,null,null,0]
[null,null,null,null,null,null,null,null,null,null,null,null,null,null,null,null,null,null,null,null,null,null,null,null,null,null,null,null,null,null,null,0]
[null,null,null,null,null,null,null,null,null,null,null,null,null,null,null,null,null,null,null,null,null,null,null,null,null,null,null,null,null,null,null,0]
[null,null,null,null,null,null,null,null,null,null,null,null,null,null,null,null,null,null,null,null,null,null,null,null,null,null,null,null,null,null,null,0]
[null,null,null,null,null,null,null,null,null,null,null,null,null,null,null,null,null,null,null,null,null,null,null,null,null,null,null,null,null,null,null,0]
[null,null,null,null,null,null,null,null,null,null,null,null,null,null,null,null,null,null,null,null,null,null,null,null,null,null,null,null,null,null,null,{"$f":"B276","v":0}]
[null,"External AI-Control",null,null,null,null,null,null,null,null,null,null,null,null,null,null,null,null,null,null,null,null,null,null,null,null,null,null,null,null,null,"External AI-Control"]
[null,"DJ119x, FDAI9x - Ext. AI-Control",0,"pcs.",0,"pcs.",0,"pcs.",0,"pcs.",0,"pcs.",0,"pcs.",0,"pcs.",0,"pcs.",null,null,{"$f":"V278+W278","v":0},0,0,{"$f":"Y278+Z278","v":1},1,0,0,0,0,0,0,"DJ119x, FDAI9x - Ext. AI-Control"]
[null,"DJ119x , FDAI9x - Ext. AI-Control Inverse",0,"pcs.",0,"pcs.",0,"pcs.",0,"pcs.",0,"pcs.",0,"pcs.",0,"pcs.",0,"pcs.",null,null,{"$f":"V279+W279","v":1},1,0,{"$f":"Y279+Z279","v":1},1,0,0,0,0,0,0,"DJ119x , FDAI9x - Ext. AI-Control Inverse"]
[null,"SPF5100 - Control module",0,"pcs.",0,"pcs.",0,"pcs.",0,"pcs.",0,"pcs.",0,"pcs.",0,"pcs.",0,"pcs.",null,null,{"$f":"V280+W280","v":0},0,0,{"$f":"Y280+Z280","v":1},1,0,0,0,0,0,0,"SPF5100 - Control module"]
[null,"SPF5100 - Control module Inverse",0,"pcs.",0,"pcs.",0,"pcs.",0,"pcs.",0,"pcs.",0,"pcs.",0,"pcs.",0,"pcs.",null,null,{"$f":"V281+W281","v":1},1,0,{"$f":"Y281+Z281","v":1},1,0,0,0,0,0,0,"SPF5100 - Control module Inverse"]
[null,null,null,null,null,null,null,null,null,null,null,null,null,null,null,null,null,null,null,null,null,null,null,null,null,null,null,null,null,null,null,0]
[null,null,null,null,null,null,null,null,null,null,null,null,null,null,null,null,null,null,null,null,null,null,null,null,null,null,null,null,null,null,null,0]
[null,null,null,null,null,null,null,null,null,null,null,null,null,null,null,null,null,null,null,null,null,null,null,null,null,null,null,null,null,null,null,0]
[null,null,null,null,null,null,null,null,null,null,null,null,null,null,null,null,null,null,null,null,null,null,null,null,null,null,null,null,null,null,null,0]
[null,null,null,null,null,null,null,null,null,null,null,null,null,null,null,null,null,null,null,null,null,null,null,null,null,null,null,null,null,null,null,0]
[null,null,null,null,null,null,null,null,null,null,null,null,null,null,null,null,null,null,null,null,null,null,null,null,null,null,null,null,null,null,null,0]
[null,null,null,null,null,null,null,null,null,null,null,null,null,null,null,null,null,null,null,null,null,null,null,null,null,null,null,null,null,null,null,0]
[null,null,null,null,null,null,null,null,null,null,null,null,null,null,null,null,null,null,null,null,null,null,null,null,null,null,null,null,null,null,null,0]
[null,null,null,null,null,null,null,null,null,null,null,null,null,null,null,null,null,null,null,null,null,null,null,null,null,null,null,null,null,null,null,0]
[null,null,null,null,null,null,null,null,null,null,null,null,null,null,null,null,null,null,null,null,null,null,null,null,null,null,null,null,null,null,null,0]
[null,"Operation and indication devices",null,null,null,null,null,null,null,null,null,null,null,null,null,null,null,null,null,null,null,null,null,null,null,null,null,null,null,null,null,"Operation and indication devices"]
[null,"FT2001 (24 LED, supply over C-NET) - Mimic",0,"pcs.",0,"pcs.",0,"pcs.",0,"pcs.",0,"pcs.",0,"pcs.",0,"pcs.",0,"pcs.",null,null,{"$f":"V293+W293","v":40},40,0,{"$f":"Y293+Z293","v":56},56,0,1,1,0,0,0,"FT2001 (24 LED, supply over C-NET) - Mimic"]
[null,"FT2001 (36 LED, supply over C-NET) - Mimic",0,"pcs.",0,"pcs.",0,"pcs.",0,"pcs.",0,"pcs.",0,"pcs.",0,"pcs.",0,"pcs.",null,null,40,40,0,78,78,0,1,1,0,0,0,"FT2001 (36 LED, supply over C-NET) - Mimic"]
[null,"FT2001 (48 LED, supply over C-NET - Mimic",0,"pcs.",0,"pcs.",0,"pcs.",0,"pcs.",0,"pcs.",0,"pcs.",0,"pcs.",0,"pcs.",null,null,40,40,0,100,100,0,1,1,0,0,0,"FT2001 (48 LED, supply over C-NET - Mimic"]
[null,"FT2001 (with external supply) - Mimic",0,"pcs.",0,"pcs.",0,"pcs.",0,"pcs.",0,"pcs.",0,"pcs.",0,"pcs.",0,"pcs.",null,null,40,40,0,40,40,0,1,1,0,0,0,"FT2001 (with external supply) - Mimic"]
[null,"FT2010 (supply over C-NET - FRT",0,"pcs.",0,"pcs.",0,"pcs.",0,"pcs.",0,"pcs.",0,"pcs.",0,"pcs.",0,"pcs.",null,null,20,20,0,160,160,0,1,1,0,0,0,"FT2010 (supply over C-NET - FRT"]
[null,"FT2010 (with external supply) - FRT",0,"pcs.",0,"pcs.",0,"pcs.",0,"pcs.",0,"pcs.",0,"pcs.",0,"pcs.",0,"pcs.",null,null,20,20,0,20,20,0,1,1,0,0,0,"FT2010 (with external supply) - FRT"]
[null,"FT2011 (supply over C-NET - FRD",0,"pcs.",0,"pcs.",0,"pcs.",0,"pcs.",0,"pcs.",0,"pcs.",0,"pcs.",0,"pcs.",null,null,20,20,0,160,160,0,1,1,0,0,0,"FT2011 (supply over C-NET - FRD"]
[null,"FT2011 (with external supply) - FRD",0,"pcs.",0,"pcs.",0,"pcs.",0,"pcs.",0,"pcs.",0,"pcs.",0,"pcs.",0,"pcs.",null,null,20,20,0,20,20,0,1,1,0,0,0,"FT2011 (with external supply) - FRD"]
[null,"FDCAI221 - Addressable alarm indicator",0,"pcs.",0,"pcs.",0,"pcs.",0,"pcs.",0,"pcs.",0,"pcs.",0,"pcs.",0,"pcs.",null,null,1,1,0,1,1,0,1,1,0,0,0,"FDCAI221 - Addressable alarm indicator"]
[null,null,null,null,null,null,null,null,null,null,null,null,null,null,null,null,null,null,null,null,null,null,null,null,null,null,null,null,null,null,null,0]
[null,null,null,null,null,null,null,null,null,null,null,null,null,null,null,null,null,null,null,null,null,null,null,null,null,null,null,null,null,null,null,0]
[null,null,null,null,null,null,null,null,null,null,null,null,null,null,null,null,null,null,null,null,null,null,null,null,null,null,null,null,null,null,null,0]
[null,null,null,null,null,null,null,null,null,null,null,null,null,null,null,null,null,null,null,null,null,null,null,null,null,null,null,null,null,null,null,0]
[null,null,null,null,null,null,null,null,null,null,null,null,null,null,null,null,null,null,null,null,null,null,null,null,null,null,null,null,null,null,null,0]
[null,null,null,null,null,null,null,null,null,null,null,null,null,null,null,null,null,null,null,null,null,null,null,null,null,null,null,null,null,null,null,0]
[null,null,null,null,null,null,null,null,null,null,null,null,null,null,null,null,null,null,null,null,null,null,null,null,null,null,null,null,null,null,null,0]
[null,null,null,null,null,null,null,null,null,null,null,null,null,null,null,null,null,null,null,null,null,null,null,null,null,null,null,null,null,null,null,0]
[null,null,null,null,null,null,null,null,null,null,null,null,null,null,null,null,null,null,null,null,null,null,null,null,null,null,null,null,null,null,null,0]
[null,null,null,null,null,null,null,null,null,null,null,null,null,null,null,null,null,null,null,null,null,null,null,null,null,null,null,null,null,null,null,0]
[]
[]
[]
[null,"Reserve for new devices"]
[null,"!! Do not fill in new lines !! "]
[null,"!! Problem with indirect links !!"]
[]
[]
[]
[]
[]
[]
[]
[]
[]
[]
[]
[]
[]
[]
[null,"Intrinsically safe stub lines 1 (Ex)  -  Line capacitance max. 82nF, line inductance max. 2.3mH, line resistance max. 50 Ohm",null,null,null,null,null,null,null,null,null,null,null,null,null,null,null,null,null,null,null,null,null,null,null,null,null,null,null,null,null,{"$f":"B332","v":"Intrinsically safe stub lines 1 (Ex)  -  Line capacitance max. 82nF, line inductance max. 2.3mH, line resistance max. 50 Ohm"}]
[null,"FDCL221-Ex - Line adaptor Ex",null,null,null,null,null,null,null,null,null,null,null,null,null,null,null,null,null,null,null,null,null,null,null,null,null,null,null,null,null,"FDCL221-Ex - Line adaptor Ex"]
[null,"OOH740-A9-Ex - Neural fire detector Ex",0,"Stk.",0,"Stk.",0,"Stk.",0,"Stk.",0,"Stk.",0,"Stk.",0,"Stk.",0,"Stk.",null,null,{"$f":"V334+W334","v":1.25},1.25,0,{"$f":"Y334+Z334","v":1.25},1.25,0,0,1,1,0,0,"OOH740-A9-Ex - Neural fire detector Ex"]
[null,"FDM223-Ex - Manual call point Ex",0,"Stk.",0,"Stk.",0,"Stk.",0,"Stk.",0,"Stk.",0,"Stk.",0,"Stk.",0,"Stk.",null,null,{"$f":"V335+W335","v":1.25},1.25,0,{"$f":"Y335+Z335","v":1.25},1.25,0,0,1,1,0,0,"FDM223-Ex - Manual call point Ex"]
[null,null,null,null,null,null,null,null,null,null,null,null,null,null,null,null,null,null,null,null,null,null,null,null,null,null,null,null,null,null,null,0]
[null,null,null,null,null,null,null,null,null,null,null,null,null,null,null,null,null,null,null,null,null,null,null,null,null,null,null,null,null,null,null,0]
[null,null,null,null,null,null,null,null,null,null,null,null,null,null,null,null,null,null,null,null,null,null,null,null,null,null,null,null,null,null,null,0]
[null,null,null,null,null,null,null,null,null,null,null,null,null,null,null,null,null,null,null,null,null,null,null,null,null,null,null,null,null,null,null,0]
[null,null,null,null,null,null,null,null,null,null,null,null,null,null,null,null,null,null,null,null,null,null,null,null,null,null,null,null,null,null,null,0]
[null,null,null,null,null,null,null,null,null,null,null,null,null,null,null,null,null,null,null,null,null,null,null,null,null,null,null,null,null,null,null,0]
[null,"Ex-Line Adaptor (FDCL221-Ex)",false,null,false,null,false,null,false,null,false,null,false,null,false,null,false,null,null,null,{"$f":"V342+W342","v":10},10,0,{"$f":"Y342+Z342","v":10},10,0,0,1,0,0,0,{"$f":"B341","v":0}]
[]
[]
[]
[]
[]
[]
[]
[]
[null,"Intrinsically safe stub lines 2 (Ex)  -  Line capacitance max. 82nF, line inductance max. 2.3mH, line resistance max. 50 Ohm",null,null,null,null,null,null,null,null,null,null,null,null,null,null,null,null,null,null,null,null,null,null,null,null,null,null,null,null,null,{"$f":"B351","v":"Intrinsically safe stub lines 2 (Ex)  -  Line capacitance max. 82nF, line inductance max. 2.3mH, line resistance max. 50 Ohm"}]
[null,"FDCL221-Ex - Line adaptor Ex",null,null,null,null,null,null,null,null,null,null,null,null,null,null,null,null,null,null,null,null,null,null,null,null,null,null,null,null,null,"FDCL221-Ex - Line adaptor Ex"]
[null,"OOH740-A9-Ex - Neural fire detector Ex",0,"Stk.",null,null,0,"Stk.",null,null,0,"Stk.",null,null,0,"Stk.",null,null,null,null,{"$f":"V353+W353","v":1.25},1.25,0,{"$f":"Y353+Z353","v":1.25},1.25,0,0,1,1,0,0,"OOH740-A9-Ex - Neural fire detector Ex"]
[null,"FDM223-Ex - Manual call point Ex",0,"Stk.",null,null,0,"Stk.",null,null,0,"Stk.",null,null,0,"Stk.",null,null,null,null,{"$f":"V354+W354","v":1.25},1.25,0,{"$f":"Y354+Z354","v":1.25},1.25,0,0,1,1,0,0,"FDM223-Ex - Manual call point Ex"]
[null,null,null,null,null,null,null,null,null,null,null,null,null,null,null,null,null,null,null,null,null,null,null,null,null,null,null,null,null,null,null,0]
[null,null,null,null,null,null,null,null,null,null,null,null,null,null,null,null,null,null,null,null,null,null,null,null,null,null,null,null,null,null,null,0]
[null,null,null,null,null,null,null,null,null,null,null,null,null,null,null,null,null,null,null,null,null,null,null,null,null,null,null,null,null,null,null,0]
[null,null,null,null,null,null,null,null,null,null,null,null,null,null,null,null,null,null,null,null,null,null,null,null,null,null,null,null,null,null,null,0]
[null,null,null,null,null,null,null,null,null,null,null,null,null,null,null,null,null,null,null,null,null,null,null,null,null,null,null,null,null,null,null,0]
[null,null,null,null,null,null,null,null,null,null,null,null,null,null,null,null,null,null,null,null,null,null,null,null,null,null,null,null,null,null,null,0]
[null,"Ex-Line Adaptor (FDCL221-Ex)",false,null,false,null,false,null,false,null,false,null,false,null,false,null,false,null,null,null,{"$f":"V361+W361","v":10},10,0,{"$f":"Y361+Z361","v":10},10,0,0,1,0,0,0]
[]
[]
[]
[]
[]
[]
[]
[]
[]
[]
[]
[]
[]
[null,"Reserve for new devices"]
[null,"!! Do not fill in new lines !! "]
[null,"!! Problem with indirect links !!"]
[]
[]
[null,"End line calculation"]
[]
[]
[]
[]
[]
[]
[]
[]
[]
[null,"Plausibility wireless device (FDCW221)",true,null,true,null,true,null,true,null,true,null,true,null,true,null,true]
[]
[null,"Plausibility SWiNG wireless device (FDCW241)",true,null,true,null,true,null,true,null,true,null,true,null,true,null,true]
[]
[]
[]
[null,null,0]
[null,null,0]
[null,"Amount of operation devices (FRT / FRD / FT2001) per loop / stub",0,null,0,null,0,null,0,null,0,null,0,null,0,null,0]
[null,"Amount of operation devices (FRT / FRD / FT2001) per line card",0,"pcs"]
[]
[null,"Plausibility Ex-Adapter (FDCL221-Ex)",true,null,true,null,true,null,true,null,true,null,true,null,true,null,true]
[]
[]
["Input cable characteristics"]
[]
[null,"Cable characteristics",{"$f":"$C$80","v":"Line card (C-NET) FCL2001-A1"}]
[null,null,{"$f":"C$82","v":"Stub1_1"},null,{"$f":"E$82","v":"Stub1_2"},null,{"$f":"G$82","v":"Stub2_1"},null,{"$f":"I$82","v":"Stub2_2"},null,{"$f":"K$82","v":"Stub3_1"},null,{"$f":"M$82","v":"Stub3_2"},null,{"$f":"O$82","v":"Stub4_1"},null,{"$f":"Q$82","v":"Stub4_2"}]
[null,"Cable length for line resistor",1,"m",1,"m",1,"m",1,"m",1,"m",1,"m",1,"m",1,"m"]
[null,"Cable length for line capacity",1,"m",1,"m",1,"m",1,"m",1,"m",1,"m",1,"m",1,"m"]
[null,"Resistance value R' of cable",70,"Ohm/km",70,"Ohm/km",70,"Ohm/km",70,"Ohm/km",70,"Ohm/km",70,"Ohm/km",70,"Ohm/km",70,"Ohm/km"]
[null,"Capacitance value Cs' of cable",70,"nF/km",70,"nF/km",70,"nF/km",70,"nF/km",70,"nF/km",70,"nF/km",70,"nF/km",70,"nF/km"]
[]
[]
[null,"Cable type"]
[null,"Enter cable parameter manually"]
[]
[]
[]
[]
[]
[]
[]
[]
[]
[]
[]
[]
[]
[]
[null,null,"Choose Cal.",null,"Choose Cal.",null,"Choose Cal.",null,"Choose Cal.",null,"Choose Cal.",null,"Choose Cal.",null,"Choose Cal.",null,"Choose Cal."]
[null,null,"Worst case",null,"Worst case",null,"Worst case",null,"Worst case",null,"Worst case",null,"Worst case",null,"Worst case",null,"Worst case"]
[]
[]
[]
[null,"Calculation characteristics",{"$f":"$C$80","v":"Line card (C-NET) FCL2001-A1"}]
[]
[null,null,{"$f":"C$82","v":"Stub1_1"},null,{"$f":"E$82","v":"Stub1_2"},null,{"$f":"G$82","v":"Stub2_1"},null,{"$f":"I$82","v":"Stub2_2"},null,{"$f":"K$82","v":"Stub3_1"},null,{"$f":"M$82","v":"Stub3_2"},null,{"$f":"O$82","v":"Stub4_1"},null,{"$f":"Q$82","v":"Stub4_2"}]
[null,"Cable length at start to first device",1,"m",1,"m",1,"m",1,"m",1,"m",1,"m",1,"m",1,"m"]
[]
[null,"Cable length at end to last device",0,"m",0,"m",0,"m",0,"m",0,"m",0,"m",0,"m",0,"m"]
[]
[null,"Average distance between devices",0,"m",0,"m",0,"m",0,"m",0,"m",0,"m",0,"m",0,"m"]
[null,"Average distance between low MK devices",1.0000000000000001E-5,"m",0,"m",3.4482758620689656E-7,"m",0,"m",3.4482758620689655E-2,"m",0,"m",3.4482758620689657E-5,"m",0,"m"]
[null,"Average distance between high MK devices",1.0000000000000001E-5,"m",0,"m",1.1111111111111112E-6,"m",0,"m",0.1111111111111111,"m",0,"m",1.1111111111111112E-4,"m",0,"m"]
[]
[]
[]
[null,"Plausibility cable lengths",true,null,true,null,true,null,true,null,true,null,true,null,true,null,true]
[]
[]
[]
[]
[]
[]
[]
[]
[]
[]
[]
[]
[]
[]
[]
[]
[]
[]
[]
[]
[null,"- Length for line resistor & definition R' see document A6V10210362"]
[null,"- Length for line capacity & definition Cs' see document A6V10210362"]
[null,"- Ex line lengths need not be added here (according to A6V10324618 and to FDCL221-Ex specification A6V10333771)"]
[]
[]
["Analysis of configuration"]
[]
[null,"Device information",{"$f":"$C$80","v":"Line card (C-NET) FCL2001-A1"}]
[null,null,{"$f":"C$82","v":"Stub1_1"},null,{"$f":"E$82","v":"Stub1_2"},null,{"$f":"G$82","v":"Stub2_1"},null,{"$f":"I$82","v":"Stub2_2"},null,{"$f":"K$82","v":"Stub3_1"},null,{"$f":"M$82","v":"Stub3_2"},null,{"$f":"O$82","v":"Stub4_1"},null,{"$f":"Q$82","v":"Stub4_2"}]
[]
[null,"Adressindex (AK) per Loop / Stub",0,null,0,null,0,null,0,null,0,null,0,null,0,null,0]
[null,"Total Adressindex (AK) per Line Card",0]
[]
[]
[null,"Isolator index (TK)",0,null,0,null,0,null,0,null,0,null,0,null,0,null,0]
[null,"Limit for MK Low/High decision",15,null,15,null,15,null,15,null,15,null,15,null,15,null,15]
[null,"Amount Low MK devices (Adressindex)",0,"pcs",0,"pcs",0,"pcs",0,"pcs",0,"pcs",0,"pcs",0,"pcs",0,"pcs"]
[null,"Amount High MK devices (Adressindex)",0,"pcs",0,"pcs",0,"pcs",0,"pcs",0,"pcs",0,"pcs",0,"pcs",0,"pcs"]
[null,"Amount Total MK devices (Adressindex)",0,"pcs",0,"pcs",0,"pcs",0,"pcs",0,"pcs",0,"pcs",0,"pcs",0,"pcs"]
[]
[]
[null,"Quietindex (RK) per Loop / Stub",0,null,0,null,0,null,0,null,0,null,0,null,0,null,0]
[null,"Deviceindex (MK) per Loop / Stub",0,null,0,null,0,null,0,null,0,null,0,null,0,null,0]
[null,"Total Deviceindex (MK) per Line Card",0]
[]
[]
[]
[null,"Ex-Line calculation"]
[null,"Capacitance Extra Load Ex-Line 1",0,"nF",0,"nF",0,"nF",0,"nF",0,"nF",0,"nF",0,"nF",0,"nF"]
[null,"Minimum Line Voltage Ex-Line 1 (less than 19V)",0,"V",0,"V",0,"V",0,"V",0,"V",0,"V",0,"V",0,"V"]
[null,"Capacitance Extra Load Ex-Line 2",0,"nF",0,"nF",0,"nF",0,"nF",0,"nF",0,"nF",0,"nF",0,"nF"]
[null,"Minimum Line Voltage Ex-Line 2 (less than 19V)",0,"V",0,"V",0,"V",0,"V",0,"V",0,"V",0,"V",0,"V"]
[null,"Alarm Indicator Current for Ex-Line (only if active)",0,"A",0,"A",0,"A",0,"A",0,"A",0,"A",0,"A",0,"A"]
[]
[]
[]
[null,"Minimal Line voltage"]
[null,"Is minimal Device Voltage 16V",false,null,false,null,false,null,false,null,false,null,false,null,false,null,false]
[null,"Minimal Device Voltage",12,"V",12,"V",12,"V",12,"V",12,"V",12,"V",12,"V",12,"V"]
[]
[]
[]
[null,"Additional Line information"]
[null,"Leak current",1.6E-2,"A",1.2E-2,"A",1.6E-2,"A",1.2E-2,"A",1.6E-2,"A",1.2E-2,"A",1.6E-2,"A",1.2E-2,"A"]
[null,"Alarm Indicator Current",5.3333333333333332E-3,"A",5.3333333333333332E-3,"A",5.3333333333333332E-3,"A",5.3333333333333332E-3,"A",5.3333333333333332E-3,"A",5.3333333333333332E-3,"A",5.3333333333333332E-3,"A",5.3333333333333332E-3,"A"]
[null,"Maximum Cable Length at Start/End for Low MK devices",900,"m",1,"m",900,"m",1,"m",899,"m",1,"m",899,"m",1,"m"]
[null,"Maximum Cable Length at Start/End for High MK devices",900,"m",1,"m",900,"m",1,"m",899,"m",1,"m",899,"m",1,"m"]
[null,"Product Rdet*TK (with High ohmic FET isolator)",0,"Ohm",0,"Ohm",0,"Ohm",0,"Ohm",0,"Ohm",0,"Ohm",0,"Ohm",0,"Ohm"]
[null,"Product Rdet*TK (with High and Low ohmic FET isolator)",0,"Ohm",0,"Ohm",0,"Ohm",0,"Ohm",0,"Ohm",0,"Ohm",0,"Ohm",0,"Ohm"]
[]
[]
[]
[]
[]
[null,"Alarm calculation",{"$f":"$C$80","v":"Line card (C-NET) FCL2001-A1"}]
[null,null,{"$f":"C$82","v":"Stub1_1"},null,{"$f":"E$82","v":"Stub1_2"},null,{"$f":"G$82","v":"Stub2_1"},null,{"$f":"I$82","v":"Stub2_2"},null,{"$f":"K$82","v":"Stub3_1"},null,{"$f":"M$82","v":"Stub3_2"},null,{"$f":"O$82","v":"Stub4_1"},null,{"$f":"Q$82","v":"Stub4_2"}]
[]
[null,"Alarm Voltage at Line Start, 1st calculation",0,"V",0,"V",0,"V",0,"V",0,"V",0,"V",0,"V",0,"V"]
[null,"Alarm Voltage at Line before Cable, 1st calculation",0,"V",0,"V",0,"V",0,"V",0,"V",0,"V",0,"V",0,"V"]
[null,"Cable resistor between last device and start line",21.6,"Ohm",0.125,"Ohm",21.6,"Ohm",0.125,"Ohm",21.576000000000001,"Ohm",0.125,"Ohm",21.576000000000001,"Ohm",0.125,"Ohm"]
[null,"Alarm Current, 1st calculation",0,"A",0,"A",0,"A",0,"A",0,"A",0,"A",0,"A",0,"A"]
[null,"Alarm Voltage at Line Start after recursion",0,"V",0,"V",0,"V",0,"V",0,"V",0,"V",0,"V",0,"V"]
[null,"Alarm Voltage at Line End after recursion",0,"V",0,"V",0,"V",0,"V",0,"V",0,"V",0,"V",0,"V"]
[]
[null,"Maximum alarm current per Loop / Stub",0.5,"A",0.5,"A",0.5,"A",0.5,"A",0.5,"A",0.5,"A",0.5,"A",0.5,"A"]
[null,"Alarm current per Loop / Stub",0,"A",0,"A",0,"A",0,"A",0,"A",0,"A",0,"A",0,"A"]
[]
[null,"Maximum alarm current per Line Card",0.5]
[null,"Total alarm current per Line Card",0]
[null,"Current consumption alarm (at Panel by 24V)",3.9E-2]
[]
[]
[null,"Quiet calculation",{"$f":"$C$80","v":"Line card (C-NET) FCL2001-A1"}]
[null,null,{"$f":"C$82","v":"Stub1_1"},null,{"$f":"E$82","v":"Stub1_2"},null,{"$f":"G$82","v":"Stub2_1"},null,{"$f":"I$82","v":"Stub2_2"},null,{"$f":"K$82","v":"Stub3_1"},null,{"$f":"M$82","v":"Stub3_2"},null,{"$f":"O$82","v":"Stub4_1"},null,{"$f":"Q$82","v":"Stub4_2"}]
[null,"Quiet Voltage at Line Start, 1st calculation",0,"V",0,"V",0,"V",0,"V",0,"V",0,"V",0,"V",0,"V"]
[null,"Quiet Voltage at Line End after recursion",0,"V",0,"V",0,"V",0,"V",0,"V",0,"V",0,"V",0,"V"]
[null,"Quiet current per Loop / Stub",0,"A",0,"A",0,"A",0,"A",0,"A",0,"A",0,"A",0,"A"]
[]
[null,"Total quiet current per Line Card",0]
[null,"Current consumption quiet (at Panel by 24V)",3.9E-2]
[]
[]
[]
[]
[]
[null,"Cabling information",{"$f":"$C$80","v":"Line card (C-NET) FCL2001-A1"}]
[null,null,{"$f":"C$82","v":"Stub1_1"},null,{"$f":"E$82","v":"Stub1_2"},null,{"$f":"G$82","v":"Stub2_1"},null,{"$f":"I$82","v":"Stub2_2"},null,{"$f":"K$82","v":"Stub3_1"},null,{"$f":"M$82","v":"Stub3_2"},null,{"$f":"O$82","v":"Stub4_1"},null,{"$f":"Q$82","v":"Stub4_2"}]
[null,"Line Resistors"]
[null,"Resistor load per Loop / Stub",7.0000000000000007E-2,"Ohm",7.0000000000000007E-2,"Ohm",7.0000000000000007E-2,"Ohm",7.0000000000000007E-2,"Ohm",7.0000000000000007E-2,"Ohm",7.0000000000000007E-2,"Ohm",7.0000000000000007E-2,"Ohm",7.0000000000000007E-2,"Ohm"]
[null,"Additional possible resistor load per Loop / Stub (approximate estimate, dRmax)",0,"Ohm",0,"Ohm",0,"Ohm",0,"Ohm",0,"Ohm",0,"Ohm",0,"Ohm",0,"Ohm"]
[null,"Additional possible cable length per Loop / Stub (approximate estimate)",0,"m",0,"m",0,"m",0,"m",0,"m",0,"m",0,"m",0,"m"]
[null,"Additional possible MK per Loop / Stub (approximate estimate)",0,null,0,null,0,null,0,null,0,null,0,null,0,null,0]
[]
[null,"Max. possible line resistor (only with High ohmic FET isolator \"old formula\")",240,"Ohm",240,"Ohm",240,"Ohm",240,"Ohm",240,"Ohm",240,"Ohm",240,"Ohm",240,"Ohm"]
[null,"Max. possible line resistor (with High and Low ohmic FET isolator \"old formula\")",240,"Ohm",240,"Ohm",240,"Ohm",240,"Ohm",240,"Ohm",240,"Ohm",240,"Ohm",240,"Ohm"]
[]
[]
[null,"Line Capacitance"]
[null,"Maximum line capacitive per Loop / Stub",750,"nF",750,"nF",750,"nF",750,"nF",750,"nF",750,"nF",750,"nF",750,"nF"]
[null,"Cable capacitive per Loop / Stub",7.0000000000000007E-2,"nF",7.0000000000000007E-2,"nF",7.0000000000000007E-2,"nF",7.0000000000000007E-2,"nF",7.0000000000000007E-2,"nF",7.0000000000000007E-2,"nF",7.0000000000000007E-2,"nF",7.0000000000000007E-2,"nF"]
[null,"Capacitive extra load of devices per Loop / Stub",0,"nF",0,"nF",0,"nF",0,"nF",0,"nF",0,"nF",0,"nF",0,"nF"]
[]
[null,"Maximum line capacitive per Line Card",{"$f":"MaxC","v":1000}]
[null,"Total capacitive load per Line Card",0.28000000000000003]
[]
[]
[null,"Refresh Check"]
[null,"Refresh Calculation Necessary",true]
[null,"Configuration Check"]
[null,"Is Line Configuration OK",true,null,true,null,true,null,true,null,true,null,true,null,true,null,true]
[null,"Is Card Configuration OK",true]
[null,"Button Text"]
[null,"Button Text","Press Button to refresh calculation"]
[null,"Calculation Check"]
[null,"Is Line calculation possible (wrong type at input fields)",true,null,true,null,true,null,true,null,true,null,true,null,true,null,true]

{"sheet":"FDnet_Constants","index":10,"n_rows":419,"n_cols":5,"rows_kept":419,"cut":false,"hidden":true,"merged":[]}
["General characteristic values"]
[]
["Max. cablelength resistor","maxLengthR",3300,"m","240 Ohm = 72 Ohm/km * 3300m (MP1.1 only 2500m)"]
["Max. cablelength capacity","maxLengthC",5000,"m","(no restriction, value could be higher)"]
["Max. Adressindex per Stub","MaxAKStub",64,"Device"]
["Max. Adressindex per Loop","MaxAKLoop",252,"Device","(restriction trough startup time)"]
["Max. Adressindex per Module","MaxAKModule",252,"Device"]
["Max. current per Module","Imax",0.5,"A","(distribution free between Loop and Stub)"]
["Max. current per Module","ImaxStation",0.88300000000000001,"A","(@ 24V, inkl. Wirkungsgrad DC/DC)"]
["Max. leakcurrent per Loop/Stub","Ileak",8.0000000000000002E-3,"A"]
["Max. leakcurrent per Module","IleakModule",2.1999999999999999E-2,"A"]
["Min. line voltage","Vline_min",31,"V"]
["Min. detector voltage","Vdet_min",12,"V"]
["Min. beacon voltage AD18","Vdet_min_AD18",16,"V"]
["Nom. Answer voltage","Vans",6,"V"]
["Detector Current","Idet",2.5000000000000001E-4,"A"]
["Operation indicator factor","OperationIndicatorFactor",0.72,null,"Current for Operation indicator ~180uA -> 180uA/250uA"]
["Internal alarm indicator current","I_Iai",2.0000000000000001E-4,"A"]
["Amount of Internal alarm indicators","N_Iai",10]
["External alarm indicator current","I_Eai",2.0000000000000001E-4,"A"]
["Amount of External alarm indicators","N_Eai",10]
["Steady on Internal alarm indicator current","I_IaiSteadyOn",1.1999999999999999E-3,"A","3ms/25ms*10mA (LED is every 25ms for 3ms active, current 10mA)"]
["Amount of steadyOn internal alarm indicators (GB)","N_IaiSteadyOn_GB",32,null,"GB standard demand 32 devices on alarm"]
["Amount of steadyOn internal alarm indicators (operation indicator)","N_IaiSteadyOn_OI",10,null,"max. 10 devices on alarm"]
["Duty Cycle","DC",0.75]
["Max. answer current resistor","Rans",250,"Ohm","250 Ohm = (5.5V / 15mA) - 120 Ohm / resistor with Detectors FET"]
["Max. cable resistor","Rcbl",240,"Ohm","240 Ohm = 72 Ohm/km * 3300m (MP1.1 only 180 Ohm)"]
["Max. FET resistor","Rdet",0.2,"Ohm"]
["Max. FET resistor for low Typ","Rdet_low",0.1,"Ohm"]
["Increase capacity from (Rc)","IncCapRc",50,"Ohm"]
["Capacity >Rc","CmaxGreatRc",500,"nF"]
["Capacity <Rc","CmaxSmalRc",750,"nF"]
["Max. capacity per Module","MaxC",1000,"nF"]
["Max. numbers of wireless device per gateway","MaxRadioDevice",30,"Device"]
["Max. numbers of wireless device per gateway SWiNG","MaxSwingDevice",30,"Device"]
["Maximum number of FRT / FRD / FT2001 per Line Card","MaxOperationDevice",20,"Device"]
[]
[]
["P2 Ex-Stub characteristic values"]
["Max. leakcurrent per Ex-Stub","IleakEx",4.3E-3,"A","Ex-Stub rules and calculation basis"]
["Min. detector voltage with FDCL-Ex","VdetEx_min",13,"V","- FDCL221-Ex together with device load is added to line"]
["Max. ex line cable res. (incl. Barriere)","RlEx",440,"Ohm","\n- from the load a minimum FDCL22-1Ex input voltage is resulting"]
["Max. loop cable resistance Ex","RansEx",190,"Ohm","- line parameters of Ex-Line need not be specified,"]
["Ex-transformer current ratio","ConvIEx",1.25,null,"  worst case values are considered  (50 Ohm, 82nF)"]
["Ex-transformer voltage ratio","ConvUEx",1.25,null,"- max. line resistance before FDCL221-Ex is 190 Ohm"]
["Ex-voltagedrop_trafo","VdropEx",1.4,"V","- up to 2 FDCL221-Ex per Loop are possible, only 1 on a stub"]
["Capacitive Load FDCL221-Ex","C_FDCL",200,"nF","- FDCL221-Ex adds 200nF capacitive load to the line"]
["Upper Limit for minimal FDCL221-Ex input voltage","V_FDCL_ul",19,"V","- FDCL221-Ex minimum input voltage must be below 19V (output clamp)"]
["Max. number of detectors in Alarm on one FDCL221-Ex","N_AI_Ex",3,null,"- 10% of allowed devices on a stub; accepted by PM for CN"]
["Max. number of detectors at adapter","MaxExDevice",20]
[]
["Formula for determination of minimal Fdnet line voltage with a connected Fdnet Ex-stub:"]
[null,null,null,null,"Vline_min may not be larger than V_FDCL_ul, otherwise"]
[null,null,null,null,"the input is clipped if to avoid unsafe voltages at the Ex-line side"]
[]
[]
[]
[]
[]
[]
[]
[]
[]
[]
[]
[]
[]
[]
[]
[]
[]
[]
[]
[]
[]
[]
[]
[]
[]
[]
[]
[]
[]
[]
[]
[]
[]
[]
[]
[]
[]
[]
[]
[]
[]
[]
[]
[]
[]
[]
[]
[]
[]
[]
[]
[]
[]
[]
[]
[]
[]
[]
[]
[]
[]
[]
[]
[]
[]
[]
[]
[]
[]
[]
[]
[]
[]
[]
[]
[]
[]
[]
[]
[]
[]
[]
[]
[]
[]
[]
[]
[]
[]
[]
[]
[]
[]
[]
[]
[]
[]
[]
[]
[]
[]
[]
[]
[]
[]
[]
[]
[]
[]
[]
[]
[]
[]
[]
[]
[]
[]
[]
[]
[]
[]
[]
[]
[]
[]
[]
[]
[]
[]
[]
[]
[]
[]
[]
[]
[]
[]
[]
[]
[]
[]
[]
[]
[]
[]
[]
[]
[]
[]
[]
[]
[]
[]
[]
[]
[]
[]
[]
[]
[]
[]
[]
[]
[]
[]
[]
[]
[]
[]
[]
[]
[]
[]
[]
[]
[]
[]
[]
[]
[]
[]
[]
[]
[]
[]
[]
[]
[]
[]
[]
[]
[]
[]
[]
[]
[]
[]
[]
[]
[]
[]
[]
[]
[]
[]
[]
[]
[]
[]
[]
[]
[]
[]
[]
[]
[]
[]
[]
[]
[]
[]
[]
[]
[]
[]
[]
[]
[]
[]
[]
[]
[]
[]
[]
[]
[]
[]
[]
[]
[]
[]
[]
[]
[]
[]
[]
[]
[]
[]
[]
[]
[]
[]
[]
[]
[]
[]
[]
[]
[]
[]
[]
[]
[]
[]
[]
[]
[]
[]
[]
[]
[]
[]
[]
[]
[]
[]
[]
[]
[]
[]
[]
[]
[]
[]
[]
[]
[]
[]
[]
[]
[]
[]
[]
[]
[]
[]
[]
[]
[]
[]
[]
[]
[]
[]
[]
[null,null,true]
[]
[null,null,true]
[]
[]
[]
[]
[]
[null,null,0]
[null,null,0]
[]
[]
[]
[]
[]
[]
[]
[]
[]
[]
[]
[]
[]
[]
[]
[]
[]
[]
[]
[]
[]
[]
[]
[]
[]
[]
[]
[]
[]
[]
[]
[]
[]
[]
[]
[]
[]
[]
[]
[]
[]
[]
[]
[]
[]
[]
[]
[]
[null,null,true]

{"sheet":"MS9I_Ref","index":11,"n_rows":71,"n_cols":10,"rows_kept":71,"cut":false,"hidden":true,"merged":[[64,3,64,4],[64,1,64,2],[64,5,64,9],[18,0,18,10],[61,3,61,4],[61,5,61,6],[61,7,61,8]]}
[null,"Planning of MS9I detector line (one line card)"]
[]
[null,"Purpose:"]
[null,"With the project planning of the detector lines the load of the line cards are verified. This results in the definite:"]
[null,"- number of required line cards"]
[null,"- number of loops and stubs"]
[null,"- load of the line card in idle and alarm state"]
[]
[null,"Please consider:"]
[null,"It is not possible to check all interactions of all options with each other. Restrictions in the use of options together are noted in the document 008843 \"Planning\" and 008851 \"Installation\"."]
[]
[null,"yellow fields","Must be filled in by the user"]
[null,"orange fields","Shows an input data error. These fields must be filled in by the user"]
[]
[null,"green fields","Calculated value, configuration valid. Field must not be changed by the user."]
[null,"red fields","Calculated value, configuration invalid. Field must not be changed by the user."]
[null,"light green fields","Calculated value, additional information for the user. Field must not be changed by the user."]
[]
["Line card (MS9i) FCL2003-A1"]
[]
[null,"Definitions:"]
[null,"1.) Lineindex loop ALK = 50 and lineindex stub ALK = 32 (connection capacity for one device line or stub) "]
[null,"2.) Loadindex AEK = loadfactor for one device (every device typ has another loadfactor)"]
[null,"3.) Maximum lineload: total of AEK for one device line must be smaller than lineindex ALK"]
[]
[null,"General characteristic values:"]
[null,"1.) Max. cable resistor with 50 devices","50 Ohm (with 50 devices)"]
[null,"2.) Max. capacity per Loop or Stub","300 nF"]
[]
[null,"Procedure:"]
[null,"1.) Define the topology of the detector lines (loop or stub)"]
[null,"2.) Define amount of K5M010 on external supply"]
[null,"3.) Calculate loadfactors (ALK's) for every loop or stub (including K5M010 factors)"]
[null,"--> For ALK definition click on pdf-symbole beside"]
[null,"4.) Define for K5M010 on external supply the line configuration (switch position) "]
[null,"5.) All data are now complete, the program calculates the load of the linecard in idle and alarm state"]
[]
[null,"Please consider:"]
[null,"In alarm-state, a worst case of 3 devices per loop/stub are calculated on alarm"]
[null,"For K5M010 on external supply, in alarm-state, a worst case of 1 stub for every K5M010 devices is calculated on alarm"]
[null,null,"Current on LineDriver voltage (@24.9V)",null,null,null,"Current on station voltage (@24V)"]
[null,"Max. current per line card MS9i",0.1,"A","(2 x 50mA @ 24.9V)",null,{"$f":"C42*24.9/(24*0.85)","v":0.12205882352941179},"A","(@ 24V bei 85% Wirkungsgrad)"]
[null,"Max. supply output for external MS9i devices",0.2,"A",null,null,{"$f":"C43*24.9/(24*0.85)","v":0.24411764705882358},"A","(@ 24V bei 85% Wirkungsgrad)"]
[null,"1 AEK is equivalent to 400uA +20%",null,null,null,null,5.5000000000000003E-4,"A","(@ 24V)"]
[null,"Alarm current offset (3 devices on alarm)",null,null,null,null,1.4999999999999999E-2,"A","(@ 24V)"]
[null,"Max. K5M010 on external supply",null,null,null,null,6,"device"]
[null,"Quiescent current K5M010",null,null,null,null,3.5000000000000001E-3,"A","(@ 24V)"]
[null,"Alarm current offset K5M010 (one stub on alarm)",null,null,null,null,0.01,"A","(@ 24V)"]
[]
[null,null,null,"Endglieder ",null,"max AEK",null,null,"Amount on K5M010"]
[null,null,1,"loop",null,50,null,1,0]
[null,null,2,"stub",null,32,null,2,1]
[null,null,null,null,null,null,null,3,2]
[null,null,"loop/stub 1",1,null,null,null,4,3]
[null,null,"loop/stub 2",1,null,null,null,5,4]
[null,null,null,null,null,null,null,6,5]
[null,null,null,null,null,null,null,7,6]
[]
[null,"Quiet current linecard UART without devices",0.04,"A   (@ 24V)",null,null,null,"Amount",1]
[]
[]
[null,"Line card (MS9i) FCL2003-A1","configuration","ALK (loadfactor)",null,"quiescent current",null,"alarm current",null,"remarks"]
[null,"Connection 1 (loop or stub)",null,0,"(including K5M010)",{"$f":"$D63*$G$44","v":0},"A",{"$f":"IF(D63=0,0,F63+$G$45)","v":0},"A"]
[null,"Connection 2 (loop or stub)",null,0,"(including K5M010)",{"$f":"$D64*$G$44","v":0},"A",{"$f":"IF(D64=0,0,F64+$G$45)","v":0},"A"]
[null,"K5M010 on external supply",null,"Switch position on K5M010"]
[null,"Amount of K5M010 on external supply",null,0,"all switch open",{"$f":"D67*$G$44*1+D68*$G$44*3+D69*$G$44*8+($I$59-1)*$G$47","v":0},"A",{"$f":"$F$66+($I$59-1)*$G$48","v":0},"A"]
[null,"(max. 6 devices with 4 stubs per K5M010) ",null,0,"Sx1 switch closed"]
[null,null,null,0,"Sx2 switch closed"]
[null,null,null,0,"Sx3 switch closed"]
[]
[null,"Overall current (at panel by 24V)",null,null,null,{"$f":"C59+F66+SUM(F63:F64)","v":0.04},"A",{"$f":"C59+H66+SUM(H63:H64)","v":0.04},"A"," (@ 24V)"]

{"sheet":"Collective_Ref","index":12,"n_rows":83,"n_cols":10,"rows_kept":83,"cut":false,"hidden":true,"merged":[[72,3,72,4],[72,5,72,6],[72,7,72,8],[18,0,18,10],[78,3,78,4],[80,3,80,4],[73,3,73,4],[75,3,75,4],[76,3,76,4],[77,3,77,4]]}
[null,"Planning of Collective detector line (one line card)"]
[]
[null,"Purpose:"]
[null,"With the project planning of the detector lines the load of the line cards are verified. This results in the definite:"]
[null,"- number of required line cards"]
[null,"- number of stubs"]
[null,"- load of the line card in idle and alarm state"]
[]
[null,"Please consider:"]
[null,"It is not possible to check all interactions of all options with each other. Restrictions in the use of options together are noted in the document 008843 \"Planning\" and 008851 \"Installation\"."]
[]
[null,"yellow fields","Must be filled in by the user"]
[null,"orange fields","Shows an input data error. These fields must be filled in by the user"]
[]
[null,"green fields","Calculated value, configuration valid. Field must not be changed by the user."]
[null,"red fields","Calculated value, configuration invalid. Field must not be changed by the user."]
[null,"light green fields","Calculated value, additional information for the user. Field must not be changed by the user."]
[]
["Line card (collective) FCL2002-A1"]
[]
[null,"Definitions:"]
[null,"1.) Sourceindex KLK = 32 (connection capacity for one device line) "]
[null,"2.) Loadindex KMK = loadfactor for one device (every device typ has another loadfactor)"]
[null,"3.) Maximum lineload: Total of KMK for one device line must be smaller than sourceindex KLK (32)"]
[]
[null,"General characteristic values:"]
[null,"1.) Max. cable resistor per stub","150 Ohm (Transzorb diode), 250 Ohm (EOL22(Ex), 3.3kOhm, 4.7kOhm)"]
[null,"2.) Max. cable capacity per stub","300 nF (for all line typs)"]
[]
[null,"Procedure:"]
[null,"1.) Define the end of line (EOF) for every stub"]
[null,"2.) All data are now complete, the program calculates the load of the line card in idle and alarm state"]
[]
[null,"Please consider:"]
[null,"As a simplification, the calculations are carried out always with a KLK of 32"]
[null,"The influence of the KLK's on the calculations are slight.  "]
[]
[null,null,null,"Current on LineDriver Voltage (@30V)",null,null,"Current on Station Voltage (@24V)"]
[null,"Max. Current per Collective Line Card",null,0.61,"A (8 x 75mA @ 30V)",null,{"$f":"D39*30/(24*0.85)","v":0.89705882352941191},"A","(@ 24V bei 85% Wirkungsgrad)"]
[null,"Max. Quellen-Kennzahl KLK per stub",null,32]
[null,"1 KMK is equivalent to 100uA +/- 50%",null,1.4999999999999999E-4,"A (@ 30V)",null,{"$f":"D41*30/(24*0.85)","v":2.2058823529411765E-4},"A","(@ 24V bei 85% Wirkungsgrad)"]
[null,"Max. devices",null,256]
[]
[null,"No grey zone transzorb (20V): quiet current","KLK kein Einfluss",{"$f":"0.0072+10/1280*0.0136","v":7.3062499999999994E-3},"A  (@ 30V)",{"$f":"D44*30/(24*0.85)","v":1.0744485294117647E-2},"A  (@ 24V bei 85%)",null,{"$f":"F44*1.1","v":1.1818933823529412E-2},"A  (@ 24V mit 10% Reserve)"]
[null,"No grey zone transzorb (20V): alarm current",null,{"$f":"0.0072+160/1280*0.0627","v":1.5037500000000001E-2},"A  (@ 30V)",2.2113970588235294E-2,"A  (@ 24V bei 85%)",null,2.4325367647058824E-2,"A  (@ 24V mit 10% Reserve)"]
[null,"No grey zone / EOL22(EX): quiet current","KLK kein Einfluss",{"$f":"0.0046+10/1280*0.0136","v":4.7062499999999995E-3},"A  (@ 30V)",6.920955882352941E-3,"A  (@ 24V bei 85%)",null,7.6130514705882359E-3,"A  (@ 24V mit 10% Reserve)"]
[null,"No grey zone / EOL22(EX): alarm current",null,{"$f":"0.0046+160/1280*0.0627","v":1.2437500000000001E-2},"A  (@ 30V)",1.8290441176470593E-2,"A  (@ 24V bei 85%)",null,2.0119485294117653E-2,"A  (@ 24V mit 10% Reserve)"]
[null,"Grey zone / 3.3 kOhm: quiet current",32,{"$f":"0.007+(C48*$D$41)","v":1.18E-2},"A  (@ 30V)",1.7352941176470588E-2,"A  (@ 24V bei 85%)",null,1.9088235294117649E-2,"A  (@ 24V mit 10% Reserve)"]
[null,"Grey zone / 3.3 kOhm: alarm current",null,{"$f":"0.0118+160/1280*0.052","v":1.83E-2},"A  (@ 30V)",2.6911764705882357E-2,"A  (@ 24V bei 85%)",null,2.9602941176470596E-2,"A  (@ 24V mit 10% Reserve)"]
[null,"Grey zone / 4.7 kOhm: quiet current",32,{"$f":"0.007+(C50*$D$41)","v":1.18E-2},"A  (@ 30V)",1.7352941176470588E-2,"A  (@ 24V bei 85%)",null,1.9088235294117649E-2,"A  (@ 24V mit 10% Reserve)"]
[null,"Grey zone / 4.7 kOhm: alarm current",null,{"$f":"0.0118+160/1280*0.052","v":1.83E-2},"A  (@ 30V)",2.6911764705882357E-2,"A  (@ 24V bei 85%)",null,2.9602941176470596E-2,"A  (@ 24V mit 10% Reserve)"]
[]
[null,null,null,"Endglieder ",null,"Quiet current",null,"Alarm current"]
[null,null,1,"no devices",null,0,"A",0,"A"]
[null,null,2,"no grey zone / transzorb (20V)",null,{"$f":"I44","v":1.1818933823529412E-2},"A",{"$f":"I45","v":2.4325367647058824E-2},"A"]
[null,null,3,"no grey zone / EOL22(EX)",null,{"$f":"I46","v":7.6130514705882359E-3},"A",{"$f":"I47","v":2.0119485294117653E-2},"A"]
[null,null,4,"grey zone / 3.3 kOhm",null,{"$f":"I48","v":1.9088235294117649E-2},"A",{"$f":"I49","v":2.9602941176470596E-2},"A"]
[null,null,5,"grey zone / 4.7 kOhm",null,{"$f":"I50","v":1.9088235294117649E-2},"A",{"$f":"I51","v":2.9602941176470596E-2},"A"]
[]
[null,null,"stub 1",1]
[null,null,"stub 2",1]
[null,null,"stub 3",1]
[null,null,"stub 4",1]
[null,null,"stub 5",1]
[null,null,"stub 6",1]
[null,null,"stub 7",1]
[null,null,"stub 8",1]
[]
[]
[null,"Quiet current linecard UART without devices",null,8.5000000000000006E-2,"A   (@ 24V)"]
[]
[]
[null,"Line card (collective) FCL2002-A1",null,"end of line (EOL)",null,"quiescent current",null,"alarm current",null,"remarks"]
[null,"Stub 1",null,null,null,{"$f":"VLOOKUP(D60,$C$54:$I$58,4,TRUE)","v":0},"A",{"$f":"VLOOKUP(D60,$C$54:$I$58,6,TRUE)","v":0},"A"]
[null,"Stub 2",null,null,null,0,"A",0,"A"]
[null,"Stub 3",null,null,null,0,"A",0,"A"]
[null,"Stub 4",null,null,null,0,"A",0,"A"]
[null,"Stub 5",null,null,null,0,"A",0,"A"]
[null,"Stub 6",null,null,null,0,"A",0,"A"]
[null,"Stub 7",null,null,null,0,"A",0,"A"]
[null,"Stub 8",null,null,null,0,"A",{"$f":"VLOOKUP(D67,$C$54:$I$58,6,TRUE)","v":0},"A"]
[]
[null,"Overall current (at panel by 24V)",null,null,null,{"$f":"SUM(F74:F81)+$D$70","v":8.5000000000000006E-2},"A",{"$f":"SUM(H74:H81)+$D$70","v":8.5000000000000006E-2},"A"," (@ 24V)"]

{"sheet":"AnalogPLUS_Ref","index":13,"n_rows":188,"n_cols":10,"rows_kept":188,"cut":false,"hidden":true,"merged":[[44,4,44,5],[43,6,43,7],[43,8,43,9],[44,6,44,7],[44,2,44,3],[105,4,105,5],[124,8,124,9],[125,8,125,9],[125,6,125,7],[105,2,105,3],[117,8,117,9],[124,2,124,3],[117,2,117,3],[117,4,117,5],[117,6,117,7],[124,6,124,7],[125,4,125,5],[126,8,126,9],[127,6,127,7],[127,8,127,9],[139,4,139,5],[139,2,139,3],[34,0,34,10],[114,0,114,10],[44,8,44,9],[43,2,43,3],[43,4,43,5],[107,4,107,5],[105,8,105,9],[105,6,105,7],[107,8,107,9],[107,6,107,7],[116,2,116,9],[107,2,107,3],[124,4,124,5],[125,2,125,3],[108,2,108,3],[108,4,108,5],[108,6,108,7],[108,8,108,9],[42,2,42,9],[144,6,144,7],[144,4,144,5],[146,2,146,3],[146,4,146,5],[140,2,140,3],[140,4,140,5],[126,2,126,3],[146,8,146,9],[139,8,139,9],[143,2,143,3],[143,8,143,9],[141,2,141,9],[143,4,143,5],[143,6,143,7],[145,2,145,9],[127,4,127,5],[127,2,127,3],[139,6,139,7],[126,4,126,5],[136,0,136,10],[146,6,146,7],[140,6,140,7],[138,2,138,9],[126,6,126,7],[153,2,153,3],[155,2,155,3],[152,2,152,3],[152,4,152,5],[155,4,155,5],[152,8,152,9],[166,6,166,7],[152,6,152,7],[153,6,153,7],[154,2,154,3],[154,4,154,5],[154,6,154,7],[153,8,153,9],[153,4,153,5],[154,8,154,9],[156,2,156,3],[156,4,156,5],[149,2,149,9],[148,2,148,9],[144,8,144,9],[140,8,140,9],[144,2,144,3],[187,8,187,9],[179,8,186,9],[178,8,178,9],[157,6,157,7],[157,8,157,9],[155,6,155,7],[156,8,156,9],[158,6,158,7],[158,8,158,9],[165,2,165,9],[158,2,158,3],[158,4,158,5],[157,4,157,5],[156,6,156,7],[157,2,157,3],[155,8,155,9],[166,2,166,3],[166,4,166,5],[166,8,166,9]]}
[null,"Planning of SynoLOOP detector lines (one line card or one module)"]
[]
[null,"Purpose:"]
[null,"With the project planning of the detector line the load of the line card is verified. This results in the definite:"]
[null,"- number and type of devices per detector line"]
[null,"- number of required line cards"]
[null,"- number of loops and stubs"]
[null,"- load of the panel in idle and alarm state"]
[]
[null,"Procedure:"]
[null,"1.) Define the types and positions of the detector line devices in the building"]
[null,"2.) Define the topology of the detector lines"]
[null,"3.) Enter the number of devices per loop / stub in the device population table"]
[null,"--> SynoLOOP connection factors (APLK) for all loops / stubs are definite"]
[null,"--> The program calculates the maximal possible line resistor and capacity (see cabling fields, marked red or green)"]
[null,"4.) Define the cable length according to the building plan (enter values at cable characteristics fields)"]
[null,"Warning: length for resistor- or capacity calculation must be calculated independent according to document A6V10210362"]
[null,"5.) Enter cable parameters (row 121 and 122)"]
[null,"6.) All data are now complete, the program calculates the configuration."]
[null,"--> If all analysis are \"green\", configuration is valid"]
[]
[]
[]
[null,"Please consider:"]
[]
[]
[]
[null,"yellow fields","Must be filled in by the user"]
[null,"orange fields","Shows an input data error. These fields must be filled in by the user"]
[]
[null,"green fields","Calculated value, configuration valid. Field must not be changed by the user."]
[null,"red fields","Calculated value, configuration invalid. Field must not be changed by the user."]
[null,"light green fields","Calculated value, additional information for the user. Field must not be changed by the user."]
[]
["Input number of devices"]
[]
[null,"Help values"]
[]
[null,"Reference Name for calculation sheet"]
[null,"AnalogPLUS_Calc_Ref"]
[]
[]
[null,"Device Population",{"$f":"\"Line card (SynoLOOP) FCL7201-Z3\"","v":"Line card (SynoLOOP) FCL7201-Z3"}]
[]
[null,null,"Loop1 / Stub1",null,"Loop2 / Stub2",null,"Loop3 / Stub3",null,"Loop4 / Stub4"]
[null,"Point detectors"]
[null,"DO1131 - Smoke detector",0,"Stk.",0,"Stk.",0,"Stk.",0,"Stk."]
[null,"DO1133 - Smoke detector",0,"Stk.",0,"Stk.",0,"Stk.",0,"Stk."]
[null,"DOT1131 - Smoke detector",0,"Stk.",0,"Stk.",0,"Stk.",0,"Stk."]
[null,"DT113x - Heat detector",0,"Stk.",0,"Stk.",0,"Stk.",0,"Stk."]
[null,"OP320A/OP620A - Optical smoke",0,"Stk.",0,"Stk.",0,"Stk.",0,"Stk."]
[null,"HI32xA/HI62xA - Heat detector",0,"Stk.",0,"Stk.",0,"Stk.",0,"Stk."]
[null,"OH320A/OH62xA - Optical heat detector",0,"Stk.",0,"Stk.",0,"Stk.",0,"Stk."]
[null,null,0,"Stk.",0,"Stk.",0,"Stk.",0,"Stk."]
[null,null,0,"Stk.",0,"Stk.",0,"Stk.",0,"Stk."]
[null,"Special detectors"]
[null,"DF1191/DC1192 - Infrared flame detector",0,"Stk.",0,"Stk.",0,"Stk.",0,"Stk."]
[null,null,0,"Stk.",0,"Stk.",0,"Stk.",0,"Stk."]
[null,null,0,"Stk.",0,"Stk.",0,"Stk.",0,"Stk."]
[null,null,0,"Stk.",0,"Stk.",0,"Stk.",0,"Stk."]
[null,"Manual call points"]
[null,"DM113x - Manual call points",0,"Stk.",0,"Stk.",0,"Stk.",0,"Stk."]
[null,"MT320A/624A - Manual call point",0,"Stk.",0,"Stk.",0,"Stk.",0,"Stk."]
[null,null,0,"Stk.",0,"Stk.",0,"Stk.",0,"Stk."]
[null,null,0,"Stk.",0,"Stk.",0,"Stk.",0,"Stk."]
[null,"Line modules"]
[null,"DC1131 - Input module (1I) ",0,"Stk.",0,"Stk.",0,"Stk.",0,"Stk."]
[null,"DC1134 - Output module (1O)",0,"Stk.",0,"Stk.",0,"Stk.",0,"Stk."]
[null,"DC1136 - In/Output module (1I&1O)",0,"Stk.",0,"Stk.",0,"Stk.",0,"Stk."]
[null,"DC1192c - 1 Collective Input (CB319A)",0,"Stk.",0,"Stk.",0,"Stk.",0,"Stk."]
[null,"DC1192h - 1 Horn Output",0,"Stk.",0,"Stk.",0,"Stk.",0,"Stk."]
[null,"CB320A - Input device SinoLINE300 (collective)",0,"Stk.",0,"Stk.",0,"Stk.",0,"Stk."]
[null,null,0,"Stk.",0,"Stk.",0,"Stk.",0,"Stk."]
[null,"Integrated modules"]
[null,null,0,"Stk.",0,"Stk.",0,"Stk.",0,"Stk."]
[null,null,0,"Stk.",0,"Stk.",0,"Stk.",0,"Stk."]
[null,null,0,"Stk.",0,"Stk.",0,"Stk.",0,"Stk."]
[null,null,0,"Stk.",0,"Stk.",0,"Stk.",0,"Stk."]
[null,"Alarm devices"]
[null,null,0,"Stk.",0,"Stk.",0,"Stk.",0,"Stk."]
[null,null,0,"Stk.",0,"Stk.",0,"Stk.",0,"Stk."]
[null,null,0,"Stk.",0,"Stk.",0,"Stk.",0,"Stk."]
[null,null,0,"Stk.",0,"Stk.",0,"Stk.",0,"Stk."]
[null,null,0,"Stk.",0,"Stk.",0,"Stk.",0,"Stk."]
[null,null,0,"Stk.",0,"Stk.",0,"Stk.",0,"Stk."]
[null,"External AI-Control"]
[null,null,0,"Stk.",0,"Stk.",0,"Stk.",0,"Stk."]
[null,null,0,"Stk.",0,"Stk.",0,"Stk.",0,"Stk."]
[null,null,0,"Stk.",0,"Stk.",0,"Stk.",0,"Stk."]
[null,null,0,"Stk.",0,"Stk.",0,"Stk.",0,"Stk."]
[null,"Operation and indication devices"]
[null,null,0,"Stk.",0,"Stk.",0,"Stk.",0,"Stk."]
[null,null,0,"Stk.",0,"Stk.",0,"Stk.",0,"Stk."]
[null,null,0,"Stk.",0,"Stk.",0,"Stk.",0,"Stk."]
[null,null,0,"Stk.",0,"Stk.",0,"Stk.",0,"Stk."]
[null,null,0,"Stk.",0,"Stk.",0,"Stk.",0,"Stk."]
[null,null,0,"Stk.",0,"Stk.",0,"Stk.",0,"Stk."]
[null,null,0,"Stk.",0,"Stk.",0,"Stk.",0,"Stk."]
[null,null,0,"Stk.",0,"Stk.",0,"Stk.",0,"Stk."]
[null,null,0,"Stk.",0,"Stk.",0,"Stk.",0,"Stk."]
[]
[null,"Reserve for new devices"]
[null,"!! Do not fill in new lines !! "]
[null,"!! Problem with indirect links !! "]
[]
[]
[]
[]
[]
[]
[]
[]
[]
[]
["Input cable characteristics"]
[]
[null,"Cable characteristics",{"$f":"C43","v":"Line card (SynoLOOP) FCL7201-Z3"}]
[null,null,{"$f":"C$45","v":"Loop1 / Stub1"},null,{"$f":"E$45","v":"Loop2 / Stub2"},null,{"$f":"G$45","v":"Loop3 / Stub3"},null,{"$f":"I$45","v":"Loop4 / Stub4"}]
[null,"Length for line resistor",1,"m",1,"m",1,"m",1,"m"]
[null,"Length for line capacity",1,"m",1,"m",1,"m",1,"m"]
[null,"Resistance value R' of cable",50,"Ohm/km",50,"Ohm/km",50,"Ohm/km",50,"Ohm/km"]
[null,"Capacitance value Cs' of cable",70,"nF/km",70,"nF/km",70,"nF/km",70,"nF/km"]
[]
[null,"Help values"]
[null,"Resistor cabling check (0 < length < max. length)",{"$f":"IF(AND(C119>=0,C119<=$C$131),1,0)","v":1},null,{"$f":"IF(AND(E119>=0,E119<=$C$131),1,0)","v":1},null,{"$f":"IF(AND(G119>=0,G119<=$C$131),1,0)","v":1},null,{"$f":"IF(AND(I119>=0,I119<=$C$131),1,0)","v":1}]
[]
[null,"Cabling plausibility (length R < length C)",{"$f":"IF(C120>=C119,1,0)","v":1},null,{"$f":"IF(E120>=E119,1,0)","v":1},null,{"$f":"IF(G120>=G119,1,0)","v":1},null,{"$f":"IF(I120>=I119,1,0)","v":1}]
[null,"R' and Cs' plausibility (R' und Cs' > 0)",{"$f":"IF(AND(C121>0,C122>0),1,0)","v":1},null,{"$f":"IF(AND(E121>0,E122>0),1,0)","v":1},null,{"$f":"IF(AND(G121>0,G122>0),1,0)","v":1},null,{"$f":"IF(AND(I121>0,I122>0),1,0)","v":1}]
[]
[null,"General characteristic values"]
[null,"Maximum length for line resistor",{"$f":"MaxLengthR_AP","v":2000},"m"]
[]
[null,null,"- Length for line resistor & definition R' see document A6V10210362"]
[null,null,"- Length for line capacity & definition Cs' see document A6V10210362"]
[]
[]
["Analysis of configuration"]
[]
[null,"Device amount",{"$f":"C43","v":"Line card (SynoLOOP) FCL7201-Z3"}]
[null,null,{"$f":"C$45","v":"Loop1 / Stub1"},null,{"$f":"E$45","v":"Loop2 / Stub2"},null,{"$f":"G$45","v":"Loop3 / Stub3"},null,{"$f":"I$45","v":"Loop4 / Stub4"}]
[null,"Adressindex (AK) per Loop / Stub",{"$f":"INDIRECT(\"'\" & $B$40 & \"'!F78\")","v":0},null,{"$f":"INDIRECT(\"'\" & $B$40 & \"'!G78\")","v":0},null,{"$f":"INDIRECT(\"'\" & $B$40 & \"'!H78\")","v":0},null,{"$f":"INDIRECT(\"'\" & $B$40 & \"'!I78\")","v":0}]
[null,"Total Adressindex (AK) per Line Card",{"$f":"SUM(C$141:J$141)","v":0}]
[]
[null,"Quietindex (RK) per Loop / Stub",{"$f":"INDIRECT(\"'\" & $B$40 & \"'!F75\")","v":0},null,{"$f":"INDIRECT(\"'\" & $B$40 & \"'!G75\")","v":0},null,{"$f":"INDIRECT(\"'\" & $B$40 & \"'!H75\")","v":0},null,{"$f":"INDIRECT(\"'\" & $B$40 & \"'!I75\")","v":0}]
[]
[]
[null,"Maximum Deviceindex per Loop/Stub",{"$f":"INDIRECT(\"'\"&$B$40&\"'!C144\")","v":166.97368421052633},null,{"$f":"INDIRECT(\"'\"&$B$40&\"'!C144\")","v":166.97368421052633},null,{"$f":"INDIRECT(\"'\"&$B$40&\"'!C144\")","v":166.97368421052633},null,{"$f":"INDIRECT(\"'\"&$B$40&\"'!C144\")","v":166.97368421052633}]
[]
[null,"Current consumption (at panel by 24V)",{"$f":"INDIRECT(\"'\" & $B$40 & \"'!C158\")","v":4.7180100334448159E-2}]
[]
[]
[null,"Help values"]
[null,"Configuration value",{"$f":"IF(C$145>=1,1,\"\")","v":""},null,{"$f":"IF(E$145>=1,1,\"\")","v":""},null,{"$f":"IF(G$145>=1,1,\"\")","v":""},null,{"$f":"IF(I$145>=1,1,\"\")","v":""}]
[null,"Leak current",{"$f":"IF(C153=1,Ileak_AP,\"\")","v":""},null,{"$f":"IF(E153=1,Ileak_AP,\"\")","v":""},null,{"$f":"IF(G153=1,Ileak_AP,\"\")","v":""},null,{"$f":"IF(I153=1,Ileak_AP,\"\")","v":""}]
[null,"Stub / Loop configuration valid (AK)",{"$f":"IF(C141<=$C$162,1,0)","v":1},null,{"$f":"IF(E141<=$C$162,1,0)","v":1},null,{"$f":"IF(G141<=$C$162,1,0)","v":1},null,{"$f":"IF(I141<=$C$162,1,0)","v":1}]
[null,"Stub / Loop configuration valid (RK)",{"$f":"IF(C144<=$C$164,1,0)","v":1},null,{"$f":"IF(E144<=$C$164,1,0)","v":1},null,{"$f":"IF(G144<=$C$164,1,0)","v":1},null,{"$f":"IF(I144<=$C$164,1,0)","v":1}]
[]
[null,"Resistor load check",{"$f":"IF(C171<=C170,1,0)","v":1},null,{"$f":"IF(E171<=E170,1,0)","v":1},null,{"$f":"IF(G171<=G170,1,0)","v":1},null,{"$f":"IF(I171<=I170,1,0)","v":1}]
[null,"Capacity load check",{"$f":"IF(C173<=C172,1,0)","v":1},null,{"$f":"IF(E173<=E172,1,0)","v":1},null,{"$f":"IF(G173<=G172,1,0)","v":1},null,{"$f":"IF(I173<=I172,1,0)","v":1}]
[null,"General characteristic values"]
[null,"Maximum current at station",{"$f":"ImaxStation_AP","v":0.88300000000000001},"A"]
[null,"Maximum Adressindex per Loop / Stub:",{"$f":"MaxAKLoop_AP","v":128},"Devices"]
[null,"Maximum Adressindex per Line Card:",{"$f":"MaxAKModule_AP","v":512},"Devices"]
[null,"Deviceindex (MK) reserve per Line Card:",{"$f":"INDIRECT(\"'\" & $B$40 & \"'!C144\")","v":166.97368421052633},"Loadfact."]
[]
[null,"Cabling",{"$f":"C43","v":"Line card (SynoLOOP) FCL7201-Z3"}]
[null,null,{"$f":"C$45","v":"Loop1 / Stub1"},null,{"$f":"E$45","v":"Loop2 / Stub2"},null,{"$f":"G$45","v":"Loop3 / Stub3"},null,{"$f":"I$45","v":"Loop4 / Stub4"}]
[null,"Maximum length for line resistor",{"$f":"INDIRECT(\"'\" & $B$40 & \"'!C99\")","v":2000},"m",{"$f":"INDIRECT(\"'\" & $B$40 & \"'!C112\")","v":2000},"m",{"$f":"INDIRECT(\"'\" & $B$40 & \"'!C125\")","v":2000},"m",{"$f":"INDIRECT(\"'\" & $B$40 & \"'!C138\")","v":2000},"m"]
[]
[null,"Maximum possible line resistor",{"$f":"INDIRECT(\"'\" & $B$40 & \"'!C96\")","v":150},"Ohm",{"$f":"INDIRECT(\"'\" & $B$40 & \"'!C109\")","v":150},"Ohm",{"$f":"INDIRECT(\"'\" & $B$40 & \"'!C122\")","v":150},"Ohm",{"$f":"INDIRECT(\"'\" & $B$40 & \"'!C135\")","v":150},"Ohm"]
[null,"Resistor load of configuration",{"$f":"INDIRECT(\"'\" & $B$40 & \"'!C100\")","v":0.05},"Ohm",{"$f":"INDIRECT(\"'\" & $B$40 & \"'!C113\")","v":0.05},"Ohm",{"$f":"INDIRECT(\"'\" & $B$40 & \"'!C126\")","v":0.05},"Ohm",{"$f":"INDIRECT(\"'\" & $B$40 & \"'!C139\")","v":0.05},"Ohm"]
[null,"Maximum possible line capacity",{"$f":"INDIRECT(\"'\" & $B$40 & \"'!I94\")","v":600},"nF",{"$f":"INDIRECT(\"'\" & $B$40 & \"'!I107\")","v":600},"nF",{"$f":"INDIRECT(\"'\" & $B$40 & \"'!I120\")","v":600},"nF",{"$f":"INDIRECT(\"'\" & $B$40 & \"'!I133\")","v":600},"nF"]
[null,"Capacity load of configuration",{"$f":"INDIRECT(\"'\" & $B$40 & \"'!I100\")","v":7.0000000000000007E-2},"nF",{"$f":"INDIRECT(\"'\" & $B$40 & \"'!I113\")","v":7.0000000000000007E-2},"nF",{"$f":"INDIRECT(\"'\" & $B$40 & \"'!I126\")","v":7.0000000000000007E-2},"nF",{"$f":"INDIRECT(\"'\" & $B$40 & \"'!I139\")","v":7.0000000000000007E-2},"nF"]
[]
[]
[]
[]
[]
[null,null,null,null,null,null,null,null,{"$f":"IF(I180=\"JC\",\"Configuration ok\",\"Configuration false\")","v":"Configuration ok"}]
[null,null,null,null,null,null,null,null,{"$f":"IF(AND(AND(C155,E155,G155,I155),AND(C156,E156,G156,I156),C142<=C163,AND(C158,E158,G158,I158),AND(C159,E159,G159,I159),AND(C125,E125,G125,I125,J125),AND(C127,E127,G127,I127),AND(C128,E128,G128,I128)),\"JC\",\"LD\")","v":"JC"}]
[]
[]
[]
[]
[]
[]
[]
[null,null,null,null,null,null,null,null,{"$f":"IF(I180=\"JC\",\"Configuration ok\",\"Configuration false\")","v":"Configuration ok"}]

{"sheet":"AnalogPLUS_Calc_Ref","index":14,"n_rows":159,"n_cols":25,"rows_kept":159,"cut":false,"hidden":true,"merged":[[10,17,10,20],[10,21,10,24],[158,5,158,6],[142,5,142,6],[77,0,77,4],[74,0,74,4],[75,0,75,4],[76,0,76,4],[10,9,10,12],[10,13,10,16]]}
["Abbreviations"]
["APAK:  AnalogPLUS Adresskennzahl; Number of by the deviced used bus-adresses (including sub-adresses)"]
["APRK:  AnalogPLUS Ruhestromkennzahl; average current of the device in idle state (in loadfactors). Necessary to calculate the emergency power"]
["APMK: AnalogPLUS Melderkennzahl; maximal average current of the device, normally in alarm state (in loadfactors), without internal or external AI"]
["APTK:  AnalogPLUS Trennerkennzahl; separator connection factor: devices with separaor = 1, without separator = 0"]
["Loadfactor: 1 loadfactor equals 190uA"]
[]
["changeable field"]
["data from input-output sheet"]
["calculation"]
[null,null,null,null,null,"Loop1","Loop2","Loop3","Loop4","Loop1",null,null,null,"Loop2",null,null,null,"Loop3",null,null,null,"Loop4"]
["Loop Device","APRK \n(=APMK)","APMK","APTK","APAK","# Devices\nline 1_1","# Devices\nline 2_1","# Devices\nline 1_1","# Devices\nline 2_1","RK \nline 1_1","MK \nline 1_1","TK \nline 1_1","AK \nline 1_1","RK \nline 2_1","MK\nline 2_1","TK \nline 2_1","AK \nline 2_1","RK \nline 1_1","MK \nline 1_1","TK \nline 1_1","AK \nline 1_1","RK \nline 2_1","MK \nline 2_1","TK \nline 2_1","AK \nline 2_1"]
["Point detectors"]
["DO1131 - Smoke detector",1,1,1,1,{"$f":"INDIRECT(\"'\" & $C$82 & \"'!C47\")","v":0},{"$f":"INDIRECT(\"'\" & $C$82 & \"'!E47\")","v":0},{"$f":"INDIRECT(\"'\" & $C$82 & \"'!G47\")","v":0},{"$f":"INDIRECT(\"'\" & $C$82 & \"'!I47\")","v":0},{"$f":"$F14*B14","v":0},{"$f":"$F14*C14","v":0},{"$f":"$F14*D14","v":0},{"$f":"$F14*E14","v":0},{"$f":"$G14*B14","v":0},{"$f":"$G14*C14","v":0},{"$f":"$G14*D14","v":0},{"$f":"$G14*E14","v":0},{"$f":"$H14*B14","v":0},{"$f":"$H14*C14","v":0},{"$f":"$H14*D14","v":0},{"$f":"$H14*E14","v":0},{"$f":"$I14*B14","v":0},{"$f":"$I14*C14","v":0},{"$f":"$I14*D14","v":0},{"$f":"$I14*E14","v":0}]
["DO1133 - Smoke detector",1,1,1,1,{"$f":"INDIRECT(\"'\" & $C$82 & \"'!C48\")","v":0},{"$f":"INDIRECT(\"'\" & $C$82 & \"'!E48\")","v":0},{"$f":"INDIRECT(\"'\" & $C$82 & \"'!G48\")","v":0},{"$f":"INDIRECT(\"'\" & $C$82 & \"'!I48\")","v":0},0,0,0,0,0,0,0,0,0,0,0,0,0,0,0,0]
["DOT1131 - Smoke detector",1,1,1,1,{"$f":"INDIRECT(\"'\" & $C$82 & \"'!C49\")","v":0},{"$f":"INDIRECT(\"'\" & $C$82 & \"'!E49\")","v":0},{"$f":"INDIRECT(\"'\" & $C$82 & \"'!G49\")","v":0},{"$f":"INDIRECT(\"'\" & $C$82 & \"'!I49\")","v":0},0,0,0,0,0,0,0,0,0,0,0,0,0,0,0,0]
["DT113x - Heat detector",1,1,1,1,{"$f":"INDIRECT(\"'\" & $C$82 & \"'!C50\")","v":0},{"$f":"INDIRECT(\"'\" & $C$82 & \"'!E50\")","v":0},{"$f":"INDIRECT(\"'\" & $C$82 & \"'!G50\")","v":0},{"$f":"INDIRECT(\"'\" & $C$82 & \"'!I50\")","v":0},0,0,0,0,0,0,0,0,0,0,0,0,0,0,0,0]
["OP320A/OP620A - Optical smoke",1,1,1,1,{"$f":"INDIRECT(\"'\" & $C$82 & \"'!C51\")","v":0},{"$f":"INDIRECT(\"'\" & $C$82 & \"'!E51\")","v":0},{"$f":"INDIRECT(\"'\" & $C$82 & \"'!G51\")","v":0},{"$f":"INDIRECT(\"'\" & $C$82 & \"'!I51\")","v":0},0,0,0,0,0,0,0,0,0,0,0,0,0,0,0,0]
["HI32xA/HI62xA - Heat detector",1,1,1,1,{"$f":"INDIRECT(\"'\" & $C$82 & \"'!C52\")","v":0},{"$f":"INDIRECT(\"'\" & $C$82 & \"'!E52\")","v":0},{"$f":"INDIRECT(\"'\" & $C$82 & \"'!G52\")","v":0},{"$f":"INDIRECT(\"'\" & $C$82 & \"'!I52\")","v":0},0,0,0,0,0,0,0,0,0,0,0,0,0,0,0,0]
["OH320A/OH62xA - Optical heat detector",1,1,1,1,{"$f":"INDIRECT(\"'\" & $C$82 & \"'!C53\")","v":0},{"$f":"INDIRECT(\"'\" & $C$82 & \"'!E53\")","v":0},{"$f":"INDIRECT(\"'\" & $C$82 & \"'!G53\")","v":0},{"$f":"INDIRECT(\"'\" & $C$82 & \"'!I53\")","v":0},0,0,0,0,0,0,0,0,0,0,0,0,0,0,0,0]
[null,0,0,0,0,{"$f":"INDIRECT(\"'\" & $C$82 & \"'!C54\")","v":0},{"$f":"INDIRECT(\"'\" & $C$82 & \"'!E54\")","v":0},{"$f":"INDIRECT(\"'\" & $C$82 & \"'!G54\")","v":0},{"$f":"INDIRECT(\"'\" & $C$82 & \"'!I54\")","v":0},0,0,0,0,0,0,0,0,0,0,0,0,0,0,0,0]
[null,0,0,0,0,{"$f":"INDIRECT(\"'\" & $C$82 & \"'!C55\")","v":0},{"$f":"INDIRECT(\"'\" & $C$82 & \"'!E55\")","v":0},{"$f":"INDIRECT(\"'\" & $C$82 & \"'!G55\")","v":0},{"$f":"INDIRECT(\"'\" & $C$82 & \"'!I55\")","v":0},0,0,0,0,0,0,0,0,0,0,0,0,0,0,0,0]
["Special detectors"]
["DF1191/DC1192 - Infrared flame detector",5,5,1,1,{"$f":"INDIRECT(\"'\" & $C$82 & \"'!C57\")","v":0},{"$f":"INDIRECT(\"'\" & $C$82 & \"'!E57\")","v":0},{"$f":"INDIRECT(\"'\" & $C$82 & \"'!G57\")","v":0},{"$f":"INDIRECT(\"'\" & $C$82 & \"'!I57\")","v":0},{"$f":"$F24*B24","v":0},0,0,0,{"$f":"$G24*B24","v":0},0,0,0,{"$f":"$H24*B24","v":0},0,0,0,{"$f":"$I24*B24","v":0},0,0,0]
[null,0,0,0,0,{"$f":"INDIRECT(\"'\" & $C$82 & \"'!C58\")","v":0},{"$f":"INDIRECT(\"'\" & $C$82 & \"'!E58\")","v":0},{"$f":"INDIRECT(\"'\" & $C$82 & \"'!G58\")","v":0},{"$f":"INDIRECT(\"'\" & $C$82 & \"'!I58\")","v":0},0,0,0,0,0,0,0,0,0,0,0,0,0,0,0,0]
[null,0,0,0,0,{"$f":"INDIRECT(\"'\" & $C$82 & \"'!C59\")","v":0},{"$f":"INDIRECT(\"'\" & $C$82 & \"'!E59\")","v":0},{"$f":"INDIRECT(\"'\" & $C$82 & \"'!G59\")","v":0},{"$f":"INDIRECT(\"'\" & $C$82 & \"'!I59\")","v":0},0,0,0,0,0,0,0,0,0,0,0,0,0,0,0,0]
[null,0,0,0,0,{"$f":"INDIRECT(\"'\" & $C$82 & \"'!C60\")","v":0},{"$f":"INDIRECT(\"'\" & $C$82 & \"'!E60\")","v":0},{"$f":"INDIRECT(\"'\" & $C$82 & \"'!G60\")","v":0},{"$f":"INDIRECT(\"'\" & $C$82 & \"'!I60\")","v":0},0,0,0,0,0,0,0,0,0,0,0,0,0,0,0,0]
["Manual call points"]
["DM113x - Manual call points",1,1,1,1,{"$f":"INDIRECT(\"'\" & $C$82 & \"'!C62\")","v":0},{"$f":"INDIRECT(\"'\" & $C$82 & \"'!E62\")","v":0},{"$f":"INDIRECT(\"'\" & $C$82 & \"'!G62\")","v":0},{"$f":"INDIRECT(\"'\" & $C$82 & \"'!I62\")","v":0},{"$f":"$F29*B29","v":0},0,0,0,{"$f":"$G29*B29","v":0},0,0,0,{"$f":"$H29*B29","v":0},0,0,0,{"$f":"$I29*B29","v":0},0,0,0]
["MT320A/624A - Manual call point",1,1,1,1,{"$f":"INDIRECT(\"'\" & $C$82 & \"'!C63\")","v":0},{"$f":"INDIRECT(\"'\" & $C$82 & \"'!E63\")","v":0},{"$f":"INDIRECT(\"'\" & $C$82 & \"'!G63\")","v":0},{"$f":"INDIRECT(\"'\" & $C$82 & \"'!I63\")","v":0},0,0,0,0,0,0,0,0,0,0,0,0,0,0,0,0]
[null,0,0,0,0,{"$f":"INDIRECT(\"'\" & $C$82 & \"'!C64\")","v":0},{"$f":"INDIRECT(\"'\" & $C$82 & \"'!E64\")","v":0},{"$f":"INDIRECT(\"'\" & $C$82 & \"'!G64\")","v":0},{"$f":"INDIRECT(\"'\" & $C$82 & \"'!I64\")","v":0},0,0,0,0,0,0,0,0,0,0,0,0,0,0,0,0]
[null,0,0,0,0,{"$f":"INDIRECT(\"'\" & $C$82 & \"'!C65\")","v":0},{"$f":"INDIRECT(\"'\" & $C$82 & \"'!E65\")","v":0},{"$f":"INDIRECT(\"'\" & $C$82 & \"'!G65\")","v":0},{"$f":"INDIRECT(\"'\" & $C$82 & \"'!I65\")","v":0},0,0,0,0,0,0,0,0,0,0,0,0,0,0,0,0]
["Line modules"]
["DC1131 - Input module (1I) ",1,1,1,1,{"$f":"INDIRECT(\"'\" & $C$82 & \"'!C67\")","v":0},{"$f":"INDIRECT(\"'\" & $C$82 & \"'!E67\")","v":0},{"$f":"INDIRECT(\"'\" & $C$82 & \"'!G67\")","v":0},{"$f":"INDIRECT(\"'\" & $C$82 & \"'!I67\")","v":0},{"$f":"$F34*B34","v":0},{"$f":"$F34*C34","v":0},{"$f":"$F34*D34","v":0},{"$f":"$F34*E34","v":0},{"$f":"$G34*B34","v":0},{"$f":"$G34*C34","v":0},{"$f":"$G34*D34","v":0},{"$f":"$G34*E34","v":0},{"$f":"$H34*B34","v":0},{"$f":"$H34*C34","v":0},{"$f":"$H34*D34","v":0},{"$f":"$H34*E34","v":0},{"$f":"$I34*B34","v":0},{"$f":"$I34*C34","v":0},{"$f":"$I34*D34","v":0},{"$f":"$I34*E34","v":0}]
["DC1134 - Output module (1O)",2,2,1,1,{"$f":"INDIRECT(\"'\" & $C$82 & \"'!C68\")","v":0},{"$f":"INDIRECT(\"'\" & $C$82 & \"'!E68\")","v":0},{"$f":"INDIRECT(\"'\" & $C$82 & \"'!G68\")","v":0},{"$f":"INDIRECT(\"'\" & $C$82 & \"'!I68\")","v":0},{"$f":"$F35*B35","v":0},{"$f":"$F35*C35","v":0},{"$f":"$F35*D35","v":0},{"$f":"$F35*E35","v":0},{"$f":"$G35*B35","v":0},{"$f":"$G35*C35","v":0},{"$f":"$G35*D35","v":0},{"$f":"$G35*E35","v":0},{"$f":"$H35*B35","v":0},{"$f":"$H35*C35","v":0},{"$f":"$H35*D35","v":0},{"$f":"$H35*E35","v":0},{"$f":"$I35*B35","v":0},{"$f":"$I35*C35","v":0},{"$f":"$I35*D35","v":0},{"$f":"$I35*E35","v":0}]
["DC1136 - In/Output module (1I&1O)",2,2,1,2,{"$f":"INDIRECT(\"'\" & $C$82 & \"'!C69\")","v":0},{"$f":"INDIRECT(\"'\" & $C$82 & \"'!E69\")","v":0},{"$f":"INDIRECT(\"'\" & $C$82 & \"'!G69\")","v":0},{"$f":"INDIRECT(\"'\" & $C$82 & \"'!I69\")","v":0},0,0,0,0,0,0,0,0,0,0,0,0,0,0,0,0]
["DC1192c - 1 Collective Input (CB319A)",3,3,1,1,{"$f":"INDIRECT(\"'\" & $C$82 & \"'!C70\")","v":0},{"$f":"INDIRECT(\"'\" & $C$82 & \"'!E70\")","v":0},{"$f":"INDIRECT(\"'\" & $C$82 & \"'!G70\")","v":0},{"$f":"INDIRECT(\"'\" & $C$82 & \"'!I70\")","v":0},0,0,0,0,0,0,0,0,0,0,0,0,0,0,0,0]
["DC1192h - 1 Horn Output",3,3,1,1,{"$f":"INDIRECT(\"'\" & $C$82 & \"'!C71\")","v":0},{"$f":"INDIRECT(\"'\" & $C$82 & \"'!E71\")","v":0},{"$f":"INDIRECT(\"'\" & $C$82 & \"'!G71\")","v":0},{"$f":"INDIRECT(\"'\" & $C$82 & \"'!I71\")","v":0},0,0,0,0,0,0,0,0,0,0,0,0,0,0,0,0]
["CB320A - Input device SinoLINE300 (collective)",3,3,1,1,{"$f":"INDIRECT(\"'\" & $C$82 & \"'!C72\")","v":0},{"$f":"INDIRECT(\"'\" & $C$82 & \"'!E72\")","v":0},{"$f":"INDIRECT(\"'\" & $C$82 & \"'!G72\")","v":0},{"$f":"INDIRECT(\"'\" & $C$82 & \"'!I72\")","v":0},0,0,0,0,0,{"$f":"$G39*C39","v":0},0,0,0,0,0,0,0,0,0,0]
[null,0,0,0,0,{"$f":"INDIRECT(\"'\" & $C$82 & \"'!C73\")","v":0},{"$f":"INDIRECT(\"'\" & $C$82 & \"'!E73\")","v":0},{"$f":"INDIRECT(\"'\" & $C$82 & \"'!G73\")","v":0},{"$f":"INDIRECT(\"'\" & $C$82 & \"'!I73\")","v":0},0,0,0,0,0,0,0,0,0,0,0,0,0,0,0,0]
["Integrated modules"]
[null,0,0,0,0,{"$f":"INDIRECT(\"'\" & $C$82 & \"'!C75\")","v":0},{"$f":"INDIRECT(\"'\" & $C$82 & \"'!E75\")","v":0},{"$f":"INDIRECT(\"'\" & $C$82 & \"'!G75\")","v":0},{"$f":"INDIRECT(\"'\" & $C$82 & \"'!I75\")","v":0},{"$f":"$F42*B42","v":0},0,0,0,{"$f":"$G42*B42","v":0},0,0,0,{"$f":"$H42*B42","v":0},0,0,0,{"$f":"$I42*B42","v":0},0,0,0]
[null,3,0,0,0,{"$f":"INDIRECT(\"'\" & $C$82 & \"'!C76\")","v":0},{"$f":"INDIRECT(\"'\" & $C$82 & \"'!E76\")","v":0},{"$f":"INDIRECT(\"'\" & $C$82 & \"'!G76\")","v":0},{"$f":"INDIRECT(\"'\" & $C$82 & \"'!I76\")","v":0},0,0,0,0,0,0,0,0,0,0,0,0,0,0,0,0]
[null,0,0,0,0,{"$f":"INDIRECT(\"'\" & $C$82 & \"'!C77\")","v":0},{"$f":"INDIRECT(\"'\" & $C$82 & \"'!E77\")","v":0},{"$f":"INDIRECT(\"'\" & $C$82 & \"'!G77\")","v":0},{"$f":"INDIRECT(\"'\" & $C$82 & \"'!I77\")","v":0},0,0,0,0,0,0,0,0,0,0,0,0,0,0,0,0]
[null,0,0,0,0,{"$f":"INDIRECT(\"'\" & $C$82 & \"'!C78\")","v":0},{"$f":"INDIRECT(\"'\" & $C$82 & \"'!E78\")","v":0},{"$f":"INDIRECT(\"'\" & $C$82 & \"'!G78\")","v":0},{"$f":"INDIRECT(\"'\" & $C$82 & \"'!I78\")","v":0},0,0,0,0,0,0,0,0,0,0,0,0,0,0,0,0]
["Alarm devices"]
[null,0,0,0,0,{"$f":"INDIRECT(\"'\" & $C$82 & \"'!C80\")","v":0},{"$f":"INDIRECT(\"'\" & $C$82 & \"'!E80\")","v":0},{"$f":"INDIRECT(\"'\" & $C$82 & \"'!G80\")","v":0},{"$f":"INDIRECT(\"'\" & $C$82 & \"'!I80\")","v":0},{"$f":"$F47*B47","v":0},0,0,0,{"$f":"$G47*B47","v":0},0,0,0,{"$f":"$H47*B47","v":0},0,0,0,{"$f":"$I47*B47","v":0},0,0,0]
[null,0,0,0,0,{"$f":"INDIRECT(\"'\" & $C$82 & \"'!C81\")","v":0},{"$f":"INDIRECT(\"'\" & $C$82 & \"'!E81\")","v":0},{"$f":"INDIRECT(\"'\" & $C$82 & \"'!G81\")","v":0},{"$f":"INDIRECT(\"'\" & $C$82 & \"'!I81\")","v":0},0,0,0,0,0,0,0,0,0,0,0,0,0,0,0,0]
[null,0,0,0,0,{"$f":"INDIRECT(\"'\" & $C$82 & \"'!C82\")","v":0},{"$f":"INDIRECT(\"'\" & $C$82 & \"'!E82\")","v":0},{"$f":"INDIRECT(\"'\" & $C$82 & \"'!G82\")","v":0},{"$f":"INDIRECT(\"'\" & $C$82 & \"'!I82\")","v":0},0,0,0,0,0,0,0,0,0,0,0,0,0,0,0,0]
[null,0,0,0,0,{"$f":"INDIRECT(\"'\" & $C$82 & \"'!C83\")","v":0},{"$f":"INDIRECT(\"'\" & $C$82 & \"'!E83\")","v":0},{"$f":"INDIRECT(\"'\" & $C$82 & \"'!G83\")","v":0},{"$f":"INDIRECT(\"'\" & $C$82 & \"'!I83\")","v":0},0,0,0,0,0,0,0,0,0,0,0,0,0,0,0,0]
[null,0,0,0,0,{"$f":"INDIRECT(\"'\" & $C$82 & \"'!C84\")","v":0},{"$f":"INDIRECT(\"'\" & $C$82 & \"'!E84\")","v":0},{"$f":"INDIRECT(\"'\" & $C$82 & \"'!G84\")","v":0},{"$f":"INDIRECT(\"'\" & $C$82 & \"'!I84\")","v":0},0,0,0,0,0,0,0,0,0,0,0,0,0,0,0,0]
[null,1,0,0,0,{"$f":"INDIRECT(\"'\" & $C$82 & \"'!C85\")","v":0},{"$f":"INDIRECT(\"'\" & $C$82 & \"'!E85\")","v":0},{"$f":"INDIRECT(\"'\" & $C$82 & \"'!G85\")","v":0},{"$f":"INDIRECT(\"'\" & $C$82 & \"'!I85\")","v":0},0,0,0,0,0,0,0,0,0,0,0,0,0,0,0,0]
["External AI-Control"]
[null,0,0,0,0,{"$f":"INDIRECT(\"'\" & $C$82 & \"'!C87\")","v":0},{"$f":"INDIRECT(\"'\" & $C$82 & \"'!E87\")","v":0},{"$f":"INDIRECT(\"'\" & $C$82 & \"'!G87\")","v":0},{"$f":"INDIRECT(\"'\" & $C$82 & \"'!I87\")","v":0},{"$f":"$F54*B54","v":0},0,0,0,{"$f":"$G54*B54","v":0},0,0,0,{"$f":"$H54*B54","v":0},0,0,0,{"$f":"$I54*B54","v":0},0,0,0]
[null,0,0,0,0,{"$f":"INDIRECT(\"'\" & $C$82 & \"'!C88\")","v":0},{"$f":"INDIRECT(\"'\" & $C$82 & \"'!E88\")","v":0},{"$f":"INDIRECT(\"'\" & $C$82 & \"'!G88\")","v":0},{"$f":"INDIRECT(\"'\" & $C$82 & \"'!I88\")","v":0},0,0,0,0,0,0,0,0,0,0,0,0,0,0,0,0]
[null,0,0,0,0,{"$f":"INDIRECT(\"'\" & $C$82 & \"'!C89\")","v":0},{"$f":"INDIRECT(\"'\" & $C$82 & \"'!E89\")","v":0},{"$f":"INDIRECT(\"'\" & $C$82 & \"'!G89\")","v":0},{"$f":"INDIRECT(\"'\" & $C$82 & \"'!I89\")","v":0},0,0,0,0,0,0,0,0,0,0,0,0,0,0,0,0]
[null,0,0,0,0,{"$f":"INDIRECT(\"'\" & $C$82 & \"'!C90\")","v":0},{"$f":"INDIRECT(\"'\" & $C$82 & \"'!E90\")","v":0},{"$f":"INDIRECT(\"'\" & $C$82 & \"'!G90\")","v":0},{"$f":"INDIRECT(\"'\" & $C$82 & \"'!I90\")","v":0},0,0,0,0,0,0,0,0,0,0,0,0,0,0,0,0]
["Operation and indication devices"]
[null,0,0,0,0,{"$f":"INDIRECT(\"'\" & $C$82 & \"'!C92\")","v":0},{"$f":"INDIRECT(\"'\" & $C$82 & \"'!E92\")","v":0},{"$f":"INDIRECT(\"'\" & $C$82 & \"'!G92\")","v":0},{"$f":"INDIRECT(\"'\" & $C$82 & \"'!I92\")","v":0},{"$f":"$F59*B59","v":0},{"$f":"$F59*C59","v":0},{"$f":"$F59*D59","v":0},{"$f":"$F59*E59","v":0},{"$f":"$G59*B59","v":0},{"$f":"$G59*C59","v":0},{"$f":"$G59*D59","v":0},{"$f":"$G59*E59","v":0},{"$f":"$H59*B59","v":0},{"$f":"$H59*C59","v":0},{"$f":"$H59*D59","v":0},{"$f":"$H59*E59","v":0},{"$f":"$I59*B59","v":0},{"$f":"$I59*C59","v":0},{"$f":"$I59*D59","v":0},{"$f":"$I59*E59","v":0}]
[null,0,0,0,0,{"$f":"INDIRECT(\"'\" & $C$82 & \"'!C93\")","v":0},{"$f":"INDIRECT(\"'\" & $C$82 & \"'!E93\")","v":0},{"$f":"INDIRECT(\"'\" & $C$82 & \"'!G93\")","v":0},{"$f":"INDIRECT(\"'\" & $C$82 & \"'!I93\")","v":0},0,0,0,0,0,0,0,0,0,0,0,0,0,0,0,0]
[null,0,0,0,0,{"$f":"INDIRECT(\"'\" & $C$82 & \"'!C94\")","v":0},{"$f":"INDIRECT(\"'\" & $C$82 & \"'!E94\")","v":0},{"$f":"INDIRECT(\"'\" & $C$82 & \"'!G94\")","v":0},{"$f":"INDIRECT(\"'\" & $C$82 & \"'!I94\")","v":0},0,0,0,0,0,0,0,0,0,0,0,0,0,0,0,0]
[null,0,0,0,0,{"$f":"INDIRECT(\"'\" & $C$82 & \"'!C95\")","v":0},{"$f":"INDIRECT(\"'\" & $C$82 & \"'!E95\")","v":0},{"$f":"INDIRECT(\"'\" & $C$82 & \"'!G95\")","v":0},{"$f":"INDIRECT(\"'\" & $C$82 & \"'!I95\")","v":0},0,0,0,0,0,0,0,0,0,0,0,0,0,0,0,0]
[null,0,0,0,0,{"$f":"INDIRECT(\"'\" & $C$82 & \"'!C96\")","v":0},{"$f":"INDIRECT(\"'\" & $C$82 & \"'!E96\")","v":0},{"$f":"INDIRECT(\"'\" & $C$82 & \"'!G96\")","v":0},{"$f":"INDIRECT(\"'\" & $C$82 & \"'!I96\")","v":0},0,0,0,0,0,0,0,0,0,0,0,0,0,0,0,0]
[null,0,0,0,0,{"$f":"INDIRECT(\"'\" & $C$82 & \"'!C97\")","v":0},{"$f":"INDIRECT(\"'\" & $C$82 & \"'!E97\")","v":0},{"$f":"INDIRECT(\"'\" & $C$82 & \"'!G97\")","v":0},{"$f":"INDIRECT(\"'\" & $C$82 & \"'!I97\")","v":0},0,0,0,0,0,0,0,0,0,0,0,0,0,0,0,0]
[null,0,0,0,0,{"$f":"INDIRECT(\"'\" & $C$82 & \"'!C98\")","v":0},{"$f":"INDIRECT(\"'\" & $C$82 & \"'!E98\")","v":0},{"$f":"INDIRECT(\"'\" & $C$82 & \"'!G98\")","v":0},{"$f":"INDIRECT(\"'\" & $C$82 & \"'!I98\")","v":0},0,0,0,0,0,0,0,0,0,0,0,0,0,0,0,0]
[null,0,0,0,0,{"$f":"INDIRECT(\"'\" & $C$82 & \"'!C99\")","v":0},{"$f":"INDIRECT(\"'\" & $C$82 & \"'!E99\")","v":0},{"$f":"INDIRECT(\"'\" & $C$82 & \"'!G99\")","v":0},{"$f":"INDIRECT(\"'\" & $C$82 & \"'!I99\")","v":0},0,0,0,0,0,0,0,0,0,0,0,0,0,0,0,0]
[null,0,0,0,0,{"$f":"INDIRECT(\"'\" & $C$82 & \"'!C100\")","v":0},{"$f":"INDIRECT(\"'\" & $C$82 & \"'!E100\")","v":0},{"$f":"INDIRECT(\"'\" & $C$82 & \"'!G100\")","v":0},{"$f":"INDIRECT(\"'\" & $C$82 & \"'!I100\")","v":0},0,0,0,0,0,0,0,0,0,0,0,0,0,0,0,0]
[]
[]
["Reserve for new devices"]
["!! Do not fill in new lines !! "]
["!! Problem with indirect links !! "]
[]
[]
["Total Quietindex (RK) per Loop/Stub",null,null,null,null,{"$f":"SUM(J14:J64)","v":0},{"$f":"SUM(N14:N64)","v":0},{"$f":"SUM(R14:R64)","v":0},{"$f":"SUM(V14:V64)","v":0}]
["Total Deviceindex (MK) per Loop/Stub",null,null,null,null,{"$f":"SUM(K14:K64)","v":0},{"$f":"SUM(O14:O64)","v":0},{"$f":"SUM(S14:S64)","v":0},{"$f":"SUM(W14:W64)","v":0}]
["Total Devideindex (TK) per Loop/Stub",null,null,null,null,{"$f":"SUM(L14:L64)","v":0},{"$f":"SUM(P14:P64)","v":0},{"$f":"SUM(T14:T64)","v":0},{"$f":"SUM(X14:X64)","v":0}]
["Total Adressindex (AK) per Loop/Stub",null,null,null,null,{"$f":"SUM(M14:M64)","v":0},{"$f":"SUM(Q14:Q64)","v":0},{"$f":"SUM(U14:U64)","v":0},{"$f":"SUM(Y14:Y64)","v":0}]
[]
["General characteristic values"]
[]
["Reference Name for calculation sheet",null,"AnalogPLUS_Ref"]
["Max. Adressindex per Loop/Stub",null,128,"Device","(restriction trough startup time)"]
[]
[]
[]
["Calculation of cable characteristics"]
[]
["Loop1 - Stub1_1"]
[]
["length for cable resistor",null,{"$f":"INDIRECT(\"'\"&$C$82&\"'!C119\")","v":1},"m",null,"length for cable capacity",null,null,{"$f":"INDIRECT(\"'\" & $C$82 & \"'!C120\")","v":1},"m"]
["see chapter 6.1.6 , document 008843",null,null,null,null,"see chapter 6.1.6 , document 008843"]
[]
["Maximum possible cable resistor","--> formula 1 (Sheet: AnalogPLUS_Constants)",{"$f":"(Vline_min_AP-Vdet_min_AP-(($F$77*Idet_AP*Rdet_AP*$F$77)/(2*DC_AP))-(($F$76-$F$77)*Idet_AP/DC_AP+Ileak_AP*Vdet_min_AP/((Vans_nom_AP/Ileak_AP-Rcbl_AP)*Ileak_AP))*Rdet_AP*$F$77)/($F$76*Idet_AP/DC_AP+Ileak_AP*Vdet_min_AP/((Vans_nom_AP/Ileak_AP-Rcbl_AP)*Ileak_AP))","v":316.45833333333337},"Ohm",null,"Maximum possible line capacity",null,null,{"$f":"IF(C100>=IncCapRc_AP,CmaxGreatRc_AP,CmaxSmalRc_AP)","v":600},"nF"]
["Restriction answer current",null,{"$f":"IF(C94>Rans_AP-($F$77*Rdet_AP),Rans_AP-($F$77*Rdet_AP),C94)","v":316.45833333333337},"Ohm"]
["Restriction cable resistor (value for calculation)",null,{"$f":"IF(C95>Rcbl_AP,Rcbl_AP,C95)","v":150},"Ohm"]
[]
["Resistor R' cable",null,{"$f":"INDIRECT(\"'\" & $C$82 & \"'!C121\")","v":50},"Ohm/km",null,"Capacity Cs' cable",null,null,{"$f":"INDIRECT(\"'\" & $C$82 & \"'!C122\")","v":70},"nF/km"]
["Maximum length R",null,{"$f":"IF(C98=0,MaxLengthR_AP,IF(C94<=0,0,IF((C94/C98*1000)>MaxLengthR_AP,MaxLengthR_AP,(C94/C98*1000))))","v":2000},"m"]
["Cable total",null,{"$f":"IF(C99<=0,0,C91/1000*C98)","v":0.05},"Ohm",{"$f":"IF(C95>=C100,\"--> Configuration OK\",\"--> Configuration not allowed\")","v":"--> Configuration OK"},null,null,null,{"$f":"I91/1000*I98","v":7.0000000000000007E-2},"nF",{"$f":"IF(I94>=I100,\"--> Configuration OK\",\"--> Configuration not allowed\")","v":"--> Configuration OK"}]
[]
["Loop2 - Stub2_1"]
[]
["length for cable resistor",null,{"$f":"INDIRECT(\"'\" & $C$82 & \"'!E119\")","v":1},"m",null,"length for cable capacity",null,null,{"$f":"INDIRECT(\"'\" & $C$82 & \"'!E120\")","v":1},"m"]
["see chapter 6.1.6 , document 008843",null,null,null,null,"see chapter 6.1.6 , document 008843"]
[]
["Maximum possible cable resistor","--> formula 1 (Sheet: AnalogPLUS_Constants)",{"$f":"(Vline_min_AP-Vdet_min_AP-(($G$77*Idet_AP*Rdet_AP*$G$77)/(2*DC_AP))-(($G$76-$G$77)*Idet_AP/DC_AP+Ileak_AP*Vdet_min_AP/((Vans_nom_AP/Ileak_AP-Rcbl_AP)*Ileak_AP))*Rdet_AP*$G$77)/($G$76*Idet_AP/DC_AP+Ileak_AP*Vdet_min_AP/((Vans_nom_AP/Ileak_AP-Rcbl_AP)*Ileak_AP))","v":316.45833333333337},"Ohm",null,"Maximum possible line capacity",null,null,{"$f":"IF(C113>=IncCapRc_AP,CmaxGreatRc_AP,CmaxSmalRc_AP)","v":600},"nF"]
["Restriction answer current",null,{"$f":"IF(C107>Rans_AP-($G$77*Rdet_AP),Rans_AP-($G$77*Rdet_AP),C107)","v":316.45833333333337},"Ohm"]
["Restriction cable resistor (value for calculation)",null,{"$f":"IF(C108>Rcbl_AP,Rcbl_AP,C108)","v":150},"Ohm"]
[]
["Resistor R' cable",null,{"$f":"INDIRECT(\"'\" & $C$82 & \"'!E121\")","v":50},"Ohm/km",null,"Capacity Cs' cable",null,null,{"$f":"INDIRECT(\"'\" & $C$82 & \"'!E122\")","v":70},"nF/km"]
["Maximum length R",null,{"$f":"IF(C111=0,MaxLengthR_AP,IF(C107<=0,0,IF((C107/C111*1000)>MaxLengthR_AP,MaxLengthR_AP,(C107/C111*1000))))","v":2000},"m"]
["Cable total",null,{"$f":"IF(C112<=0,0,C104/1000*C111)","v":0.05},"Ohm",{"$f":"IF(C108>=C113,\"--> Configuration OK\",\"--> Configuration not allowed\")","v":"--> Configuration OK"},null,null,null,{"$f":"I104/1000*I111","v":7.0000000000000007E-2},"nF",{"$f":"IF(I107>=I113,\"--> Configuration OK\",\"--> Configuration not allowed\")","v":"--> Configuration OK"}]
[]
["Loop3 - Stub3_1"]
[]
["length for cable resistor",null,{"$f":"INDIRECT(\"'\" & $C$82 & \"'!G119\")","v":1},"m",null,"length for cable capacity",null,null,{"$f":"INDIRECT(\"'\" & $C$82 & \"'!G120\")","v":1},"m"]
["see chapter 6.1.6 , document 008843",null,null,null,null,"see chapter 6.1.6 , document 008843"]
[]
["Maximum possible cable resistor","--> formula 1 (Sheet: AnalogPLUS_Constants)",{"$f":"(Vline_min_AP-Vdet_min_AP-(($H$77*Idet_AP*Rdet_AP*$H$77)/(2*DC_AP))-(($H$76-$H$77)*Idet_AP/DC_AP+Ileak_AP*Vdet_min_AP/((Vans_nom_AP/Ileak_AP-Rcbl_AP)*Ileak_AP))*Rdet_AP*$H$77)/($H$76*Idet_AP/DC_AP+Ileak_AP*Vdet_min_AP/((Vans_nom_AP/Ileak_AP-Rcbl_AP)*Ileak_AP))","v":316.45833333333337},"Ohm",null,"Maximum possible line capacity",null,null,{"$f":"IF(C126>=IncCapRc_AP,CmaxGreatRc_AP,CmaxSmalRc_AP)","v":600},"nF"]
["Restriction answer current",null,{"$f":"IF(C120>Rans_AP-($H$77*Rdet_AP),Rans_AP-($H$77*Rdet_AP),C120)","v":316.45833333333337},"Ohm"]
["Restriction cable resistor (value for calculation)",null,{"$f":"IF(C121>Rcbl_AP,Rcbl_AP,C121)","v":150},"Ohm"]
[]
["Resistor R' cable",null,{"$f":"INDIRECT(\"'\" & $C$82 & \"'!G121\")","v":50},"Ohm/km",null,"Capacity Cs' cable",null,null,{"$f":"INDIRECT(\"'\" & $C$82 & \"'!G122\")","v":70},"nF/km"]
["Maximum length R",null,{"$f":"IF(C124=0,MaxLengthR_AP,IF(C120<=0,0,IF((C120/C124*1000)>MaxLengthR_AP,MaxLengthR_AP,(C120/C124*1000))))","v":2000},"m"]
["Cable total",null,{"$f":"IF(C125<=0,0,C117/1000*C124)","v":0.05},"Ohm",{"$f":"IF(C121>=C126,\"--> Configuration OK\",\"--> Configuration not allowed\")","v":"--> Configuration OK"},null,null,null,{"$f":"I117/1000*I124","v":7.0000000000000007E-2},"nF",{"$f":"IF(I120>=I126,\"--> Configuration OK\",\"--> Configuration not allowed\")","v":"--> Configuration OK"}]
[]
["Loop4 - Stub4_1"]
[]
["length for cable resistor",null,{"$f":"INDIRECT(\"'\" & $C$82 & \"'!I119\")","v":1},"m",null,"length for cable capacity",null,null,{"$f":"INDIRECT(\"'\" & $C$82 & \"'!I120\")","v":1},"m"]
["see chapter 6.1.6 , document 008843",null,null,null,null,"see chapter 6.1.6 , document 008843"]
[]
["Maximum possible cable resistor","--> formula 1 (Sheet: AnalogPLUS_Constants)",{"$f":"(Vline_min_AP-Vdet_min_AP-(($I$77*Idet_AP*Rdet_AP*$I$77)/(2*DC_AP))-(($I$76-$I$77)*Idet_AP/DC_AP+Ileak_AP*Vdet_min_AP/((Vans_nom_AP/Ileak_AP-Rcbl_AP)*Ileak_AP))*Rdet_AP*$I$77)/($I$76*Idet_AP/DC_AP+Ileak_AP*Vdet_min_AP/((Vans_nom_AP/Ileak_AP-Rcbl_AP)*Ileak_AP))","v":316.45833333333337},"Ohm",null,"Maximum possible line capacity",null,null,{"$f":"IF(C139>=IncCapRc_AP,CmaxGreatRc_AP,CmaxSmalRc_AP)","v":600},"nF"]
["Restriction answer current",null,{"$f":"IF(C133>Rans_AP-($I$77*Rdet_AP),Rans_AP-($I$77*Rdet_AP),C133)","v":316.45833333333337},"Ohm"]
["Restriction cable resistor (value for calculation)",null,{"$f":"IF(C134>Rcbl_AP,Rcbl_AP,C134)","v":150},"Ohm"]
[]
["Resistor R' cable",null,{"$f":"INDIRECT(\"'\" & $C$82 & \"'!I121\")","v":50},"Ohm/km",null,"Capacity Cs' cable",null,null,{"$f":"INDIRECT(\"'\" & $C$82 & \"'!I122\")","v":70},"nF/km"]
["Maximum length R",null,{"$f":"IF(C137=0,MaxLengthR_AP,IF(C133<=0,0,IF((C133/C137*1000)>MaxLengthR_AP,MaxLengthR_AP,(C133/C137*1000))))","v":2000},"m"]
["Cable total",null,{"$f":"IF(C138<=0,0,C130/1000*C137)","v":0.05},"Ohm",{"$f":"IF(C134>=C139,\"--> Configuration OK\",\"--> Configuration not allowed\")","v":"--> Configuration OK"},null,null,null,{"$f":"I130/1000*I137","v":7.0000000000000007E-2},"nF",{"$f":"IF(I133>=I139,\"--> Configuration OK\",\"--> Configuration not allowed\")","v":"--> Configuration OK"}]
[]
["Power consumption calculatin"]
[]
["Total leakcurrent",null,{"$f":"Ileak_AP","v":1.4999999999999999E-2},"A",null,"Eingangsspg. [V]",null,{"$f":"AVERAGE(F145:F158)","v":24}]
["Deviceindex (MK) reserve","--> formula 2 (Sheet: AnalogPLUS_Constants)",{"$f":"(Imax_AP-$C$143*Vline_nom_AP/Vans_nom_AP)*(DC_AP/Idet_AP)","v":166.97368421052633},null,null,"Uin [V]","Iin [A]","Uout [V]","Iout  [A]","n"]
[null,null,null,null,null,24,4.6899999999999997E-2,29.9,1.7600000000000001E-2,{"$f":"((H145*I145)/(F145*G145))","v":0.46751954513148547}]
[null,null,null,null,null,24,5.6599999999999998E-2,29.91,2.5000000000000001E-2,0.55046378091872794]
[null,null,null,null,null,24,9.3799999999999994E-2,29.94,5.0500000000000003E-2,0.67162846481876348]
[null,null,null,null,null,24,0.12889999999999999,29.96,7.5499999999999998E-2,0.73118050168088966]
[null,null,null,null,null,24,0.1663,30.03,0.1018,0.76594858689116063]
[null,null,null,null,null,24,0.20019999999999999,30.06,0.1255,0.78515859140859134]
[null,null,null,null,null,24,0.2369,30.06,0.1512,0.79940059096665261]
[null,null,null,null,null,24,0.3085,30.12,0.20050000000000001,0.81564829821717999]
["Quietindex (RK) actual",null,{"$f":"SUM(INDIRECT(\"'\" & $C$82 & \"'!C144\"):INDIRECT(\"'\" & $C$82 & \"'!J144\"))","v":0},null,null,24,0.38279999999999997,30.13,0.25180000000000002,0.82579393068617224]
["Current consumption by Fdnet (quiet)",null,{"$f":"I145+($C$153*Idet_AP/DC_AP)","v":1.7600000000000001E-2},"A",null,24,0.4536,30.18,0.30009999999999998,0.83195712081128737]
["Lower values from table (current and efficiency)",null,{"$f":"VLOOKUP($C$154,$I$145:$I$158,1,TRUE)","v":1.7600000000000001E-2},"A",{"$f":"VLOOKUP($C$155,$I$145:$J$158,2,TRUE)","v":0.46751954513148547},24,0.60229999999999995,30.2,0.40189999999999998,0.83965493386463008]
["Higher values from table (current and efficiency)",null,{"$f":"INDIRECT(\"I\"&(145+MATCH($C$155,$I$145:$I$158)))","v":2.5000000000000001E-2},"A",{"$f":"INDIRECT(\"J\"&(145+MATCH($C$155,$I$145:$I$158)))","v":0.55046378091872794},24,0.75009999999999999,30.25,0.50149999999999995,0.84268625294405175]
["Calculatet Efficency",null,{"$f":"IF($C$156<$C$155,$E$155,$E$155+($C$154-$C$155)/($C$156-$C$155)*($E$156-$E$155))","v":0.46751954513148547},null,null,24,0.89670000000000005,30.16,0.60219999999999996,0.84394409129772119]
["Power consumption by panel",null,{"$f":"(H159*C154/H143)/C157","v":4.7180100334448159E-2},"A",null,24,1.0458000000000001,30.2,0.70079999999999998,0.84322050105182622]
[null,null,null,null,null,"Output voltage [V]",null,{"$f":"AVERAGE(H145:H158)","v":30.078571428571429}]

{"sheet":"AnalogPLUS_Constants","index":15,"n_rows":34,"n_cols":5,"rows_kept":34,"cut":false,"hidden":true,"merged":[]}
["General characteristic values"]
[]
["Max. cablelength resistor","maxLengthR_AP",2000,"m"]
["Max. Adressindex per Loop/Stub","MaxAKLoop_AP",128,"Device","(Restriction trough startup time)"]
["Max. Adressindex per Module","MaxAKModule_AP",512,"Device"]
["Max. current per Module","Imax_AP",7.4999999999999997E-2,"A","(Current limitation charge voltage per Loop or Stub)"]
["Max. current per Module","ImaxStation_AP",0.88300000000000001,"A","(@ 24V, inkl. Wirkungsgrad DC/DC)"]
["Max. leakcurrent per Loop/Stub","Ileak_AP",1.4999999999999999E-2,"A","Warnlevel firmware at 10mA (5mA reserve)"]
["Nom. line voltage","Vline_nom_AP",26.5,"V"]
["Min. line voltage","Vline_min_AP",25.8,"V"]
["Min. detector voltage","Vdet_min_AP",16,"V"]
["Nom. answer voltage","Vans_nom_AP",10,"V"]
["Detector Current","Idet_AP",1.9000000000000001E-4,"A","from 700-001-006, page 16"]
["Duty Cycle","DC_AP",0.9,null,"Need verification"]
["Max. answer current resistor","Rans_AP",325,"Ohm","325 Ohm = (8.5V / 12mA) - 383 Ohm / Detector has 383R resistor"]
["Max. cable resistor","Rcbl_AP",150,"Ohm"]
["Max. FET resistor","Rdet_AP",1.3,"Ohm","from 700-001-006, page 18"]
["Increase capacity from (Rc)","IncCapRc_AP",50,"Ohm"]
["Capacity >Rc","CmaxGreatRc_AP",300,"nF"]
["Capacity <Rc","CmaxSmalRc_AP",600,"nF"]
[]
[]
["Formula 1:"]
[]
[]
[]
[]
[]
[]
[]
[]
[]
[]
["Formula 2:"]

{"sheet":"Interactive_Ref","index":16,"n_rows":188,"n_cols":9,"rows_kept":188,"cut":false,"hidden":true,"merged":[[157,8,157,9],[158,2,158,3],[156,8,156,9],[187,8,187,9],[179,8,186,9],[178,8,178,9],[166,6,166,7],[165,2,165,9],[166,2,166,3],[166,4,166,5],[166,8,166,9],[158,6,158,7],[158,8,158,9],[108,4,108,5],[108,6,108,7],[108,8,108,9],[158,4,158,5],[152,6,152,7],[153,6,153,7],[116,2,116,9],[138,2,138,9],[155,6,155,7],[155,8,155,9],[157,6,157,7],[154,6,154,7],[153,4,153,5],[153,8,153,9],[154,8,154,9],[153,2,153,3],[155,2,155,3],[155,4,155,5],[157,4,157,5],[156,6,156,7],[154,2,154,3],[154,4,154,5],[157,2,157,3],[143,2,143,3],[141,2,141,3],[152,2,152,3],[152,4,152,5],[152,8,152,9],[44,2,44,3],[45,6,45,7],[107,6,107,7],[156,2,156,3],[156,4,156,5],[117,2,117,3],[140,2,140,3],[139,2,139,3],[136,0,136,10],[149,2,149,9],[124,2,124,3],[125,2,125,3],[126,2,126,3],[127,2,127,3],[148,2,148,9],[146,2,146,3],[44,4,44,5],[43,6,43,7],[34,0,34,10],[114,0,114,10],[44,8,44,9],[43,2,43,3],[43,4,43,5],[107,4,107,5],[105,8,105,9],[105,6,105,7],[107,8,107,9],[42,2,42,9],[43,8,43,9],[44,6,44,7],[105,4,105,5],[105,2,105,3]]}
[null,"Planning of Interactive detector lines (one line card or one module)"]
[]
[null,"Purpose:"]
[null,"With the project planning of the detector line the load of the line card is verified. This results in the definite:"]
[null,"- number and type of devices per detector line"]
[null,"- number of required line cards"]
[null,"- number of loops and stubs"]
[null,"- load of the panel in idle and alarm state"]
[]
[null,"Procedure:"]
[null,"1.) Define the types and positions of the detector line devices in the building"]
[null,"2.) Define the topology of the detector lines"]
[null,"3.) Enter the number of devices per loop / stub in the device population table"]
[null,"--> Interactive connection factors (ILK) for all loops / stubs are definite"]
[null,"--> The program calculates the maximal possible line resistor and capacity (see cabling fields, marked red or green)"]
[null,"4.) Define the cable length according to the building plan (enter values at cable characteristics fields)"]
[null,"Warning: length for resistor- or capacity calculation must be calculated independent according to document A6V10210362"]
[null,"5.) Enter cable parameters (row 121 and 122)"]
[null,"6.) All data are now complete, the program calculates the configuration."]
[null,"--> If all analysis are \"green\", configuration is valid"]
[]
[]
[]
[null,"Please consider:"]
[]
[]
[]
[null,"yellow fields","Must be filled in by the user"]
[null,"orange fields","Shows an input data error. These fields must be filled in by the user"]
[]
[null,"green fields","Calculated value, configuration valid. Field must not be changed by the user."]
[null,"red fields","Calculated value, configuration invalid. Field must not be changed by the user."]
[null,"light green fields","Calculated value, additional information for the user. Field must not be changed by the user."]
[]
["Input number of devices"]
[]
[null,"Help values",null,null,"Interactive Selection"]
[null,null,null,null,"Interactive"]
[null,"Reference Name for calculation sheet",null,null,"Interactive Ex"]
[null,"Interactive_Calc_Ref",null,null,"Interactive Ex"]
[null,null,null,null,1]
[]
[null,"Device Population",{"$f":"IF(E41=2,\"Line card (Interactive Ex) FCL2007-A1\",\"Line card (Interactive) FCL2006-A1\")","v":"Line card (Interactive) FCL2006-A1"}]
[]
[null,null,{"$f":"IF(E41=2,\"Stub1\",\"Loop1 / Stub1\")","v":"Loop1 / Stub1"},null,null,null,"External supply"]
[null,"Point detectors",null,null,null,null,"+24V output"]
[null,"DO1151  - Smoke detector (OptoRex)",0,"Stk.",null,null,0,"A"]
[null,"DO1151A  - Smoke detector (OptoRex)",0,"Stk."]
[null,"DOT1151 - Smoke detectors (PolyRex)",0,"Stk."]
[null,"DOT1151A - Smoke detectors (PolyRex)",0,"Stk."]
[null,"DOT1151A-Ex - Smoke detectors Ex (PolyRex)",0,"Stk."]
[null,"DO1152 - Smoke detectors with line separator (OptoRex)",0,"Stk."]
[null,"DO1152A - Smoke detectors with line separator (OptoRex)",0,"Stk."]
[null,"DO1153 - Smoke detectors with line separator and high sensitivity (OptoRex)",0,"Stk."]
[null,"DO1153A - Smoke detectors with line separator and high sensitivity (OptoRex)",0,"Stk."]
[null,"DOT1152 - Smoke detectors with line separator (PolyRex)",0,"Stk."]
[null,"DOT1152A - Smoke detectors with line separator (PolyRex)",0,"Stk."]
[null,"DOTE1152A - Smoke detectors with line separator (PolyRex)",0,"Stk."]
[null,"DT1152 - Heat detectors with line separator (ThermoRex)",0,"Stk."]
[null,"DT1152A - Heat detectors with line separator (ThermoRex)",0,"Stk."]
[null,"DT1151A-Ex - Heat detectors Ex (ThermoRex)",0,"Stk."]
[null,null,0,"Stk."]
[null,null,0,"Stk."]
[null,"Special detectors"]
[null,"DLO1191 - Linear smoke detector (BeamRex)",0,"Stk."]
[null,"DLO1191A - Linear smoke detector (BeamRex)",0,"Stk."]
[null,"DF1191 - Infrared flame detector (1 sensor)",0,"Stk."]
[null,"DF1192 - Infrared flame detector (2 sensors/1 photo diode)",0,"Stk."]
[null,"DF1191-Ex - Infrared flame detector Ex (WaveRex)",0,"Stk."]
[null,null,0,"Stk."]
[null,null,0,"Stk."]
[null,"Manual call points"]
[null,"DM115x - Manual call point",0,"Stk."]
[null,"DM1153-Ex - Manual call point Ex",0,"Stk."]
[null,"DMA1153x - Switching unit",0,"Stk."]
[null,"DM1154-Ex - Manual call point Ex",0,"Stk."]
[null,"DMA1154A - Switching unit",0,"Stk."]
[null,"DMA1154B/C/D - Switching unit",0,"Stk."]
[null,null,0,"Stk."]
[null,"Line modules"]
[null,"DCA1151(x) - Input Module (1 Collective Input)",0,"Stk."]
[null,"DCA1154(x) - In/Output module (1I&1O)",0,"Stk."]
[null,"DC1154-AA - In/Output module (1I&1O)",0,"Stk."]
[null,"DC1156-AA - Output module (3O)",0,"Stk."]
[null,"DCA1157(x) - Input module (3I)",0,"Stk."]
[null,"DC1157-AA - Input module (3I)",0,"Stk."]
[null,"DCA1192A - 1 Collective Input ",0,"Stk."]
[null,"DCA1192A - 1 Horn Output ",0,"Stk."]
[null,"CB320A - Input device for SinoLINE300 (collective)",0,"Stk."]
[null,"DC1159A - Line isolator",0,"Stk."]
[null,null,0,"Stk."]
[null,"Radio devices"]
[null,"DWA1151(x) - Radio gateway",0,"Stk."]
[null,"DOW1171, DOW1191 - detectors",0,"Stk."]
[null,"DWA1191 - Receiver Module",0,"Stk."]
[null,null,0,"Stk."]
[null,null,0,"Stk."]
[null,null,0,"Stk."]
[null,null,0,"Stk."]
[null,null,0,"Stk."]
[]
[null,"Reserve for new devices"]
[null,"!! Do not fill in new lines !! "]
[null,"!! Problem with indirect links !! "]
[]
[]
[]
[null,"Help values"]
[null,"Plausibility wireless device (FDCW221)",{"$f":"IF(OR(AND(C94>0,C93=0),IF(C93=0,0,IF(C94/C93>$C$112,1,0))),0,1)","v":1}]
[]
[null,"General characteristic values"]
[null,"Max. numbers of wireless device per gateway",30,"pcs"]
[]
[]
["Input cable characteristics"]
[]
[null,"Cable characteristics",{"$f":"C43","v":"Line card (Interactive) FCL2006-A1"}]
[null,null,{"$f":"C$45","v":"Loop1 / Stub1"}]
[null,"Length for line resistor",1,"m"]
[null,"Length for line capacity",1,"m"]
[null,"Resistance value R' of cable",50,"Ohm/km"]
[null,"Capacitance value Cs' of cable",70,"nF/km"]
[]
[null,"Help values"]
[null,"Resistor cabling check (0 < length < max. length)",{"$f":"IF(AND(C119>=0,C119<=$C$131),1,0)","v":1},null,"Max. possible external supply current",null,null,0.5,"A"]
[]
[null,"Cabling plausibility (length R < length C)",{"$f":"IF(C120>=C119,1,0)","v":1}]
[null,"R' and Cs' plausibility (R' und Cs' > 0)",{"$f":"IF(AND(C121>0,C122>0),1,0)","v":1}]
[]
[null,"General characteristic values"]
[null,"Maximum length for line resistor",{"$f":"MaxLengthR_AP","v":2000},"m"]
[]
[null,null,"- Length for line resistor & definition R' see document 008843"]
[null,null,"- Length for line capacity & definition Cs' see document 008843"]
[]
[]
["Analysis of configuration"]
[]
[null,"Device amount",{"$f":"C43","v":"Line card (Interactive) FCL2006-A1"}]
[null,null,{"$f":"C$45","v":"Loop1 / Stub1"}]
[null,"Adressindex (AK) per Loop / Stub",{"$f":"INDIRECT(\"'\" & $B$40 & \"'!F78\")","v":0}]
[null,"Trennerindex (TK) per Loop / Stub",{"$f":"INDIRECT(\"'\" & $B$40 & \"'!F77\")","v":0}]
[]
[null,"Quietindex (RK) per Loop / Stub",{"$f":"INDIRECT(\"'\" & $B$40 & \"'!F75\")","v":0}]
[]
[]
[null,"Maximum Deviceindex per Loop/Stub",{"$f":"INDIRECT(\"'\"&$B$40&\"'!C144\")","v":133.71428571428572}]
[]
[null,"Current consumption - Interactive detectors and ext. supply (at panel by 24V)",{"$f":"INDIRECT(\"'\" & $B$40 & \"'!C158\")","v":6.3020135199293059E-2}]
[]
[]
[null,"Help values"]
[null,"Configuration value",{"$f":"IF(C$145>=1,1,\"\")","v":""}]
[null,"Leak current",{"$f":"IF(C153=1,Ileak_AP,\"\")","v":""}]
[null,"Stub / Loop configuration valid (AK)",{"$f":"IF(C141<=$C$162,1,0)","v":1}]
[null,"Stub / Loop configuration valid (RK)",{"$f":"IF(C144<=$C$164,1,0)","v":1}]
[]
[null,"Resistor load check",{"$f":"IF(C171<=C170,1,0)","v":1}]
[null,"Capacity load check",{"$f":"IF(C173<=C172,1,0)","v":1}]
[null,"General characteristic values"]
[null,"Maximum current at station",{"$f":"ImaxStation_AP","v":0.88300000000000001},"A"]
[null,"Maximum Adressindex per Loop / Stub:",{"$f":"MaxAKLoop_AP","v":128},"Devices"]
[null,"MaximumTrennerindex per Loop / Stub:",{"$f":"MaxAKLoop_AP","v":128}]
[null,"Deviceindex (MK) reserve per Line Card:",{"$f":"INDIRECT(\"'\" & $B$40 & \"'!C144\")","v":133.71428571428572},"Loadfact."]
[]
[null,"Cabling",{"$f":"C43","v":"Line card (Interactive) FCL2006-A1"}]
[null,null,{"$f":"C$45","v":"Loop1 / Stub1"}]
[null,"Maximum length for line resistor",{"$f":"INDIRECT(\"'\" & $B$40 & \"'!C110\")","v":2000},"m"]
[]
[null,"Maximum possible line resistor",{"$f":"INDIRECT(\"'\" & $B$40 & \"'!C107\")","v":120.001},"Ohm"]
[null,"Resistor load of configuration",{"$f":"INDIRECT(\"'\" & $B$40 & \"'!C111\")","v":0.05},"Ohm"]
[null,"Maximum possible line capacity",{"$f":"INDIRECT(\"'\" & $B$40 & \"'!I104\")","v":800},"nF"]
[null,"Capacity load of configuration",{"$f":"INDIRECT(\"'\" & $B$40 & \"'!I111\")","v":7.0000000000000007E-2},"nF"]
[]
[]
[]
[]
[]
[null,null,null,null,null,null,null,null,{"$f":"IF(I180=\"JC\",\"Configuration ok\",\"Configuration false\")","v":"Configuration ok"}]
[null,null,null,null,null,null,null,null,{"$f":"IF(AND(C155,C141<=C162,C158,C159,C125,C127,C128,G47<=H125,C144<C147),\"JC\",\"LD\")","v":"JC"}]
[]
[]
[]
[]
[]
[]
[]
[null,null,null,null,null,null,null,null,{"$f":"IF(I180=\"JC\",\"Configuration ok\",\"Configuration false\")","v":"Configuration ok"}]

{"sheet":"Interactive_Calc_Ref","index":17,"n_rows":162,"n_cols":15,"rows_kept":162,"cut":false,"hidden":true,"merged":[[161,5,161,6],[142,5,142,6],[77,0,77,4],[74,0,74,4],[75,0,75,4],[76,0,76,4],[120,5,120,6],[131,5,131,6]]}
["Abbreviations"]
["IAK: Interactive Adresskennzahl; Number of by the deviced used bus-adresses (including sub-adresses)"]
["IRK: Interactive Ruhestromkennzahl; average current of the device in idle state (in loadfactors). Necessary to calculate the emergency power"]
["IMK: Interactive Connection Factor; maximal average current of the device, normally in alarm state (in loadfactors), without internal or external AI"]
["ITK:  Interactive Line Separator Factor; separator connection factor: devices with separaor = 1, without separator = 0"]
["Loadfactor: 1 loadfactor equals 225uA"]
[]
["changeable field"]
["data from input-output sheet"]
["calculation"]
[null,null,null,null,null,"Loop1","Loop1"]
["Loop Device","RK (= IMK)","IMK","ITK","IAK","# Devices\nline 1_1","RK \nline 1_1","MK \nline 1_1","TK \nline 1_1","AK \nline 1_1"]
["Point detectors"]
["DO1151  - Smoke detector (OptoRex)",1,1,0,1,{"$f":"INDIRECT(\"'\" & $C$82 & \"'!C47\")","v":0},{"$f":"$F14*B14","v":0},{"$f":"$F14*C14","v":0},{"$f":"$F14*D14","v":0},{"$f":"$F14*E14","v":0}]
["DO1151A  - Smoke detector (OptoRex)",1,1,0,1,{"$f":"INDIRECT(\"'\" & $C$82 & \"'!C48\")","v":0},0,0,0,0]
["DOT1151 - Smoke detectors (PolyRex)",1,1,0,1,{"$f":"INDIRECT(\"'\" & $C$82 & \"'!C49\")","v":0},0,0,0,0]
["DOT1151A - Smoke detectors (PolyRex)",1,1,0,1,{"$f":"INDIRECT(\"'\" & $C$82 & \"'!C50\")","v":0},0,0,0,0]
["DOT1151A-Ex - Smoke detectors Ex (PolyRex)",1,1,0,1,{"$f":"INDIRECT(\"'\" & $C$82 & \"'!C51\")","v":0},0,0,0,0]
["DO1152 - Smoke detectors with line separator (OptoRex)",1,1,1,1,{"$f":"INDIRECT(\"'\" & $C$82 & \"'!C52\")","v":0},0,0,0,0]
["DO1152A - Smoke detectors with line separator (OptoRex)",1,1,1,1,{"$f":"INDIRECT(\"'\" & $C$82 & \"'!C53\")","v":0},0,0,0,0]
["DO1153 - Smoke detectors with line separator and high sensitivity (OptoRex)",1,1,1,1,{"$f":"INDIRECT(\"'\" & $C$82 & \"'!C54\")","v":0},0,0,0,0]
["DO1153A - Smoke detectors with line separator and high sensitivity (OptoRex)",1,1,1,1,{"$f":"INDIRECT(\"'\" & $C$82 & \"'!C55\")","v":0},0,0,0,0]
["DOT1152 - Smoke detectors with line separator (PolyRex)",1,1,1,1,{"$f":"INDIRECT(\"'\" & $C$82 & \"'!C56\")","v":0},0,0,0,0]
["DOT1152A - Smoke detectors with line separator (PolyRex)",1,1,1,1,{"$f":"INDIRECT(\"'\" & $C$82 & \"'!C57\")","v":0},0,0,0,0]
["DOTE1152A - Smoke detectors with line separator (PolyRex)",1,1,1,1,{"$f":"INDIRECT(\"'\" & $C$82 & \"'!C58\")","v":0},0,0,0,0]
["DT1152 - Heat detectors with line separator (ThermoRex)",1,1,1,1,{"$f":"INDIRECT(\"'\" & $C$82 & \"'!C59\")","v":0},0,0,0,0]
["DT1152A - Heat detectors with line separator (ThermoRex)",1,1,1,1,{"$f":"INDIRECT(\"'\" & $C$82 & \"'!C60\")","v":0},0,0,0,0]
["DT1151A-Ex - Heat detectors Ex (ThermoRex)",1,1,0,1,{"$f":"INDIRECT(\"'\" & $C$82 & \"'!C61\")","v":0},0,0,0,0]
[null,0,0,0,0,{"$f":"INDIRECT(\"'\" & $C$82 & \"'!C62\")","v":0},0,0,0,0]
[null,0,0,0,0,{"$f":"INDIRECT(\"'\" & $C$82 & \"'!C63\")","v":0},0,0,0,0]
["Special detectors"]
["DLO1191 - Linear smoke detector (BeamRex)",10,10,1,1,{"$f":"INDIRECT(\"'\" & $C$82 & \"'!C65\")","v":0},{"$f":"$F32*B32","v":0},0,0,0]
["DLO1191A - Linear smoke detector (BeamRex)",10,10,1,1,{"$f":"INDIRECT(\"'\" & $C$82 & \"'!C66\")","v":0},0,0,0,0]
["DF1191 - Infrared flame detector (1 sensor)",3,3,1,1,{"$f":"INDIRECT(\"'\" & $C$82 & \"'!C67\")","v":0},0,0,0,0]
["DF1192 - Infrared flame detector (2 sensors/1 photo diode)",3,3,1,1,{"$f":"INDIRECT(\"'\" & $C$82 & \"'!C68\")","v":0},0,0,0,0]
["DF1191-Ex - Infrared flame detector Ex (WaveRex)",3,3,1,1,{"$f":"INDIRECT(\"'\" & $C$82 & \"'!C69\")","v":0},0,0,0,0]
[null,0,0,0,0,{"$f":"INDIRECT(\"'\" & $C$82 & \"'!C70\")","v":0},{"$f":"$F37*B37","v":0},0,0,0]
[null,0,0,0,0,{"$f":"INDIRECT(\"'\" & $C$82 & \"'!C71\")","v":0},0,0,0,0]
["Manual call points"]
["DM115x - Manual call point",1,1,1,1,{"$f":"INDIRECT(\"'\" & $C$82 & \"'!C73\")","v":0},{"$f":"$F40*B40","v":0},{"$f":"$F40*C40","v":0},{"$f":"$F40*D40","v":0},{"$f":"$F40*E40","v":0}]
["DM1153-Ex - Manual call point Ex",1,1,0,1,{"$f":"INDIRECT(\"'\" & $C$82 & \"'!C74\")","v":0},{"$f":"$F41*B41","v":0},0,0,0]
["DMA1153x - Switching unit",1,1,1,1,{"$f":"INDIRECT(\"'\" & $C$82 & \"'!C75\")","v":0},0,0,0,0]
["DM1154-Ex - Manual call point Ex",1,1,0,1,{"$f":"INDIRECT(\"'\" & $C$82 & \"'!C76\")","v":0},0,0,0,0]
["DMA1154A - Switching unit",1,1,0,1,{"$f":"INDIRECT(\"'\" & $C$82 & \"'!C77\")","v":0},0,0,0,0]
["DMA1154B/C/D - Switching unit",1,1,1,1,{"$f":"INDIRECT(\"'\" & $C$82 & \"'!C78\")","v":0},0,0,0,0]
[null,0,0,0,0,{"$f":"INDIRECT(\"'\" & $C$82 & \"'!C79\")","v":0},0,0,0,0]
["Line modules"]
["DCA1151(x) - Input Module (1 Collective Input)",12,12,1,1,{"$f":"INDIRECT(\"'\" & $C$82 & \"'!C81\")","v":0},{"$f":"$F48*B48","v":0},{"$f":"$F48*C48","v":0},{"$f":"$F48*D48","v":0},{"$f":"$F48*E48","v":0}]
["DCA1154(x) - In/Output module (1I&1O)",2,2,1,1,{"$f":"INDIRECT(\"'\" & $C$82 & \"'!C82\")","v":0},0,0,0,0]
["DC1154-AA - In/Output module (1I&1O)",2,2,1,1,{"$f":"INDIRECT(\"'\" & $C$82 & \"'!C83\")","v":0},0,0,0,0]
["DC1156-AA - Output module (3O)",3,3,1,1,{"$f":"INDIRECT(\"'\" & $C$82 & \"'!C84\")","v":0},0,0,0,0]
["DCA1157(x) - Input module (3I)",3,3,1,1,{"$f":"INDIRECT(\"'\" & $C$82 & \"'!C85\")","v":0},0,0,0,0]
["DC1157-AA - Input module (3I)",3,3,1,1,{"$f":"INDIRECT(\"'\" & $C$82 & \"'!C86\")","v":0},0,0,0,0]
["DCA1192A - 1 Collective Input ",2,2,1,1,{"$f":"INDIRECT(\"'\" & $C$82 & \"'!C87\")","v":0},0,0,0,0]
["DCA1192A - 1 Horn Output ",2,2,1,1,{"$f":"INDIRECT(\"'\" & $C$82 & \"'!C88\")","v":0},0,0,0,0]
["CB320A - Input device for SinoLINE300 (collective)",2,2,1,1,{"$f":"INDIRECT(\"'\" & $C$82 & \"'!C89\")","v":0},0,0,0,0]
["DC1159A - Line isolator",1,1,1,0,{"$f":"INDIRECT(\"'\" & $C$82 & \"'!C90\")","v":0},0,0,0,0]
[null,0,0,0,0,{"$f":"INDIRECT(\"'\" & $C$82 & \"'!C91\")","v":0},0,0,0,0]
["Radio devices"]
["DWA11512(x) - Radio gateway",8,8,1,1,{"$f":"INDIRECT(\"'\" & $C$82 & \"'!C93\")","v":0},{"$f":"IF($F60>0,$F60*($B60+($F61/$F60)*$B61),0)","v":0},{"$f":"IF($F60>0,$F60*($C60+($F61/$F60)*$C61),0)","v":0},{"$f":"IF($F60>0,$F60*($D60+($F61/$F60)*$D61),0)","v":0},{"$f":"IF($F60>0,$F60*($E60+($F61/$F60)*$E61),0)","v":0}]
["DOW1171, DOW1191 - detectors",0,0,0,1,{"$f":"INDIRECT(\"'\" & $C$82 & \"'!C94\")","v":0},{"$f":"0","v":0},{"$f":"0","v":0},{"$f":"0","v":0},{"$f":"0","v":0}]
["DWA1191 - Receiver Module",2,2,0,0,{"$f":"INDIRECT(\"'\" & $C$82 & \"'!C95\")","v":0},{"$f":"$F62*B62","v":0},0,0,0]
[null,0,0,0,0,{"$f":"INDIRECT(\"'\" & $C$82 & \"'!C96\")","v":0},0,0,0,0]
[null,0,0,0,0,{"$f":"INDIRECT(\"'\" & $C$82 & \"'!C97\")","v":0},0,0,0,0]
[null,0,0,0,0,{"$f":"INDIRECT(\"'\" & $C$82 & \"'!C98\")","v":0},0,0,0,0]
[null,0,0,0,0,{"$f":"INDIRECT(\"'\" & $C$82 & \"'!C99\")","v":0},0,0,0,0]
[null,0,0,0,0,{"$f":"INDIRECT(\"'\" & $C$82 & \"'!C100\")","v":0},0,0,0,0]
[]
[]
["Reserve for new devices"]
["!! Do not fill in new lines !! "]
["!! Problem with indirect links !! "]
[]
[]
["Total Quietindex (RK) per Loop/Stub",null,null,null,null,{"$f":"SUM(G14:G67)","v":0}]
["Total Deviceindex (MK) per Loop/Stub",null,null,null,null,{"$f":"SUM(H14:H67)","v":0}]
["Total Devideindex (TK) per Loop/Stub",null,null,null,null,{"$f":"SUM(I14:I67)","v":0}]
["Total Adressindex (AK) per Loop/Stub",null,null,null,null,{"$f":"SUM(J14:J67)","v":0}]
[]
["General characteristic values"]
[]
["Reference Name for calculation sheet",null,"Interactive_Ref"]
["Max. Adressindex per Loop/Stub",null,{"$f":"IF(C84=1,MaxAKLoop_I,MaxAKLoopEx_I)","v":128},"Device","(restriction trough startup time)"]
["Interactive (1) / Interactive Ex (2)",null,{"$f":"INDIRECT(\"'\"&$C$82&\"'!E41\")","v":1}]
[]
[]
["Calculation of cable characteristics"]
[]
["Loop1 - Stub1_1"]
[]
["length for cable resistor",null,{"$f":"INDIRECT(\"'\"&$C$82&\"'!C119\")","v":1},"m",null,"length for cable capacity",null,null,{"$f":"INDIRECT(\"'\" & $C$82 & \"'!C120\")","v":1},"m"]
["see chapter 6.1.6 , document 008843",null,null,null,null,"see chapter 6.1.6 , document 008843"]
[]
["Find resistor and capacity value according to graph at 001508"]
[null,"MK (out of line)","Condition",null,"Zone1",null,null,"Zone2",null,null,"Zone3",null,null,"Zone4"]
["Zone1",{"$f":"-72/146*F$76+72","v":72},{"$f":"B96>=$F$77","v":true},null,"Res. [Ω]","Cap. [nF]",null,"Res. [Ω]","Cap. [nF]",null,"Res. [Ω]","Cap. [nF]",null,"Res. [Ω]","Cap. [nF]"]
["Zone2",{"$f":"-216/128*$F$76+216","v":216},{"$f":"B97>=$F$77","v":true},null,0,800,null,0,600,null,0,600,null,0,600]
["Zone3",{"$f":"-53/128*$F$76+113","v":113},{"$f":"B98>=$F$77","v":true},null,50.000999999999998,400,null,50.000999999999998,400,null,50.000999999999998,400,null,35.000999999999998,400]
[null,null,null,null,120.001,400,null,100.001,300,null,75.001000000000005,300,null,75.001000000000005,400]
[null,null,null,null,null,null,null,120.001,300,null,90.001000000000005,300]
[]
[]
[]
["Maximum possible cable resistor","--> formula 1 (Sheet: Interactive_Constants)",{"$f":"IF(C84=1,(Vline_min_I-Vdet_min_I-(($F$77*Idet_I*Rdet_I*$F$77)/(2*DC_I))-(($F$76-$F$77)*Idet_I/DC_I+Ileak_I*Vdet_min_I/((Vans_nom_I/Ileak_I-Rcbl_I)*Ileak_I))*Rdet_I*$F$77)/($F$76*Idet_I/DC_I+Ileak_I*Vdet_min_I/((Vans_nom_I/Ileak_I-Rcbl_I)*Ileak_I)),(Vline_min_Ex_I-Vdet_min_I-(($F$77*Idet_I*Rdet_I*$F$77)/(2*DC_I))-(($F$76-$F$77)*Idet_I/DC_I+Ileak_I*Vdet_min_I/((Vans_nom_I/Ileak_I-Rcbl_I)*Ileak_I))*Rdet_I*$F$77)/($F$76*Idet_I/DC_I+Ileak_I*Vdet_min_I/((Vans_nom_I/Ileak_I-Rcbl_I)*Ileak_I)))","v":388.83720930232562},"Ohm",null,"Maximum possible line capacity",null,null,{"$f":"IF($C$96=TRUE,VLOOKUP($C$111,$E$97:$F$99,2,TRUE),IF($C$97=TRUE,VLOOKUP($C$111,$H$97:$I$100,2,TRUE),IF($C$98=TRUE,VLOOKUP($C$111,$K$97:$L$100,2,TRUE),VLOOKUP($C$111,$N$97:$O$99,2,TRUE))))","v":800},"nF","according graph at 001508"]
["Restriction answer current",null,{"$f":"IF(C104>Rans_I-($F$77*Rdet_I),Rans_I-($F$77*Rdet_I),C104)","v":290},"Ohm"]
["Maximum possible cable resistor",null,{"$f":"IF($C$96=TRUE,MAX(E97:E99),IF($C$97=TRUE,MAX(H97:H100),IF($C$98=TRUE,MAX(K97:K100),MAX(N97:N99))))","v":120.001},"Ohm","according graph at 001508"]
["Restriction cable resistor (value for calculation)",null,{"$f":"IF(C105>C106,C106,C105)","v":120.001},"Ohm"]
[]
["Resistor R' cable",null,{"$f":"INDIRECT(\"'\" & $C$82 & \"'!C121\")","v":50},"Ohm/km",null,"Capacity Cs' cable",null,null,{"$f":"INDIRECT(\"'\" & $C$82 & \"'!C122\")","v":70},"nF/km"]
["Maximum length R",null,{"$f":"IF(C109=0,MaxLengthR_I,IF(C104<=0,0,IF((C104/C109*1000)>MaxLengthR_I,MaxLengthR_I,(C104/C109*1000))))","v":2000},"m"]
["Cable total",null,{"$f":"IF(C110<=0,0,C91/1000*C109)","v":0.05},"Ohm",{"$f":"IF(C105>=C111,\"--> Configuration OK\",\"--> Configuration not allowed\")","v":"--> Configuration OK"},null,null,null,{"$f":"I91/1000*I109","v":7.0000000000000007E-2},"nF",{"$f":"IF(I104>=I111,\"--> Configuration OK\",\"--> Configuration not allowed\")","v":"--> Configuration OK"}]
[]
[]
[]
[]
[]
[]
[]
["Current consumption by external supply"]
[]
["Current consumption by external supply",null,{"$f":"INDIRECT(\"'\"&$C$82&\"'!G47\")+I123","v":1.0000000000000001E-5},"A",null,"Eingangsspg. [V]",null,{"$f":"AVERAGE(F123:F131)","v":35.36577777777778}]
[null,null,null,null,null,"Uin [V]","Iin [A]","Uout [V]","Iout  [A]","n"]
[null,null,null,null,null,35.6,1.175E-2,24.4,1.0000000000000001E-5,{"$f":"((H123*I123)/(F123*G123))","v":5.8331341142720536E-4}]
["Lower values from table (current and efficiency)",null,{"$f":"VLOOKUP($C$121,$I$123:$I$131,1,TRUE)","v":1.0000000000000001E-5},"A",{"$f":"VLOOKUP($C$124,$I$123:$J$131,2,TRUE)","v":5.8331341142720536E-4},35.56,4.8059999999999999E-2,24.31,4.8000000000000001E-2,0.6827798210616931]
["Higher values from table (current and efficiency)",null,{"$f":"INDIRECT(\"I\"&(123+MATCH($C$124,$I$123:$I$131)))","v":4.8000000000000001E-2},"A",{"$f":"INDIRECT(\"J\"&(123+MATCH($C$124,$I$123:$I$131)))","v":0.6827798210616931},35.549999999999997,8.3799999999999999E-2,24.28,9.9059999999999995E-2,0.80735284936003948]
["Calculatet Efficency",null,{"$f":"IF($C$125<$C$124,$E$124,$E$124+($C$121-$C$124)/($C$125-$C$124)*($E$125-$E$124))","v":5.8331341142720536E-4},null,null,35.53,0.15240000000000001,24.22,0.19700000000000001,0.88117098928634485]
["Power consumption by external supply",null,{"$f":"(H132*C121/H121)/C126","v":1.1740483291401873E-2},"A",null,35,0.29799999999999999,24.109000000000002,0.39800000000000002,0.91997909875359551]
[null,null,null,null,null,35.119999999999997,0.36099999999999999,24,0.49299999999999999,0.93324667621577628]
[null,null,null,null,null,35.276000000000003,0.33900000000000002,17.899999999999999,0.61,0.91306949563509432]
[null,null,null,null,null,35.314,0.20699999999999999,7.73,0.79600000000000004,0.84173484041992919]
[null,null,null,null,null,35.341999999999999,4.9000000000000002E-2,0.496,0.93700000000000006,0.26837006094385013]
[null,null,null,null,null,"Output voltage [V]",null,{"$f":"AVERAGE(H123:H128)","v":24.21983333333333}]
[]
[]
[]
[]
[]
[]
[]
[]
["Power consumption calculatin"]
[]
["Total leakcurrent",null,{"$f":"Ileak_I","v":0.01},"A",null,"Eingangsspg. [V]",null,24]
["Deviceindex (MK) reserve","--> formula 2 (Sheet: Interactive_Constants)",{"$f":"IF(C84=1,(Imax_I-$C$143*Vline_nom_I/Vans_nom_I)*(DC_I/Idet_I),(ImaxEx_I-$C$143*Vline_nom_Ex_I/Vans_nom_I)*(DC_I/Idet_I))","v":133.71428571428572},null,null,"Uin [V]","Iin [A]","Uout [V]","Iout  [A]","n"]
[null,null,null,null,null,{"$f":"$H$143","v":24},3.9100000000000003E-2,35.69,8.4499999999999992E-3,{"$f":"((H145*I145)/(F145*G145))","v":0.32137734441602722}]
[null,null,null,null,null,24,6.25E-2,35.61,0.02,0.47480000000000006]
[null,null,null,null,null,24,8.09E-2,35.61,3.0200000000000001E-2,0.55388442521631653]
[null,null,null,null,null,24,9.7799999999999998E-2,35.61,4.0399999999999998E-2,0.61291922290388545]
[null,null,null,null,null,24,0.11509999999999999,35.619999999999997,5.0700000000000002E-2,0.65375543006081671]
[null,null,null,null,null,24,0.156,35.619999999999997,7.5499999999999998E-2,0.71829861111111115]
[null,null,null,null,null,24,0.19900000000000001,35.630000000000003,0.10199999999999999,0.76094221105527637]
[null,null,null,null,null,24,0.28399999999999997,35.65,0.152,0.79501173708920203]
["Quietindex (RK) actual",null,{"$f":"SUM(INDIRECT(\"'\" & $C$82 & \"'!C144\"):INDIRECT(\"'\" & $C$82 & \"'!R144\"))","v":0},null,null,24,0.375,35.659999999999997,0.20599999999999999,0.81621777777777771]
["Current consumption by Interactive and external supply (quiet)",null,{"$f":"I145+($C$153*Idet_I/DC_I)+C127","v":2.019048329140187E-2},"A",null,24,0.44900000000000001,35.67,0.251,0.83084354120267268]
["Lower values from table (current and efficiency)",null,{"$f":"VLOOKUP($C$154,$I$145:$I$161,1,TRUE)","v":0.02},"A",{"$f":"VLOOKUP($C$155,$I$145:$J$161,2,TRUE)","v":0.47480000000000006},24,0.53400000000000003,35.69,0.30099999999999999,0.83822487515605482]
["Higher values from table (current and efficiency)",null,{"$f":"INDIRECT(\"I\"&(145+MATCH($C$155,$I$145:$I$161)))","v":3.0200000000000001E-2},"A",{"$f":"INDIRECT(\"J\"&(145+MATCH($C$155,$I$145:$I$161)))","v":0.55388442521631653},24,0.61899999999999999,35.700000000000003,0.35099999999999998,0.84347738287560581]
["Calculatet Efficency",null,{"$f":"IF($C$156<$C$155,$E$155,$E$155+($C$154-$C$155)/($C$156-$C$155)*($E$156-$E$155))","v":0.47627688839351268},null,null,24,0.71099999999999997,35.72,0.40400000000000003,0.84569151429910927]
["Power consumption by panel",null,{"$f":"(H162*C154/H143)/C157","v":6.3020135199293059E-2},"A",null,24,0.78800000000000003,35.729999999999997,0.45,0.8501744923857868]
[null,null,null,null,null,24,0.88300000000000001,35.75,0.50600000000000001,0.85360041525103814]
[null,null,null,null,null,24,1.0529999999999999,35.770000000000003,0.60199999999999998,0.85207106679328914]
[null,null,null,null,null,24,1.2370000000000001,35.799999999999997,0.70499999999999996,0.85014147130153583]
[null,null,null,null,null,"Output voltage [V]",null,{"$f":"AVERAGE(H145:H161)","v":35.678235294117641}]

{"sheet":"Interactive_Constants","index":18,"n_rows":36,"n_cols":5,"rows_kept":36,"cut":false,"hidden":true,"merged":[]}
["General characteristic values"]
[]
["Max. cablelength resistor","maxLengthR_I",2000,"m"]
["Max. Adressindex per Loop/Stub","MaxAKLoop_I",128,"Device"]
["Max. Adressindex Ex per Stub","MaxAKLoopEx_I",32,"Device","only stub allowed"]
["Max. current per Module","Imax_I",0.11,"A"]
["Max. current Ex per Module","ImaxEx_I",5.3999999999999999E-2,"A"]
["Max. current per Module","ImaxStation_I",0.88300000000000001,"A","(@ 24V, inkl. Wirkungsgrad DC/DC)"]
["Max. leakcurrent per Loop/Stub","Ileak_I",0.01,"A","Warnlevel firmware at 10mA, no reserve - but reserve at detector current"]
["Nom. line voltage","Vline_nom_I",32,"V"]
["Nom. line voltage Ex","Vline_nom_Ex_I",25,"V"]
["Min. line voltage","Vline_min_I",31,"V","from 700-001-011, page 31"]
["Min. line voltage","Vline_min_Ex_I",24,"V"]
["Min. detector voltage","Vdet_min_I",21.5,"V","from 700-001-011, page 31"]
["Nom. answer voltage","Vans_nom_I",10,"V","from 700-001-011, page 30"]
["Detector Current","Idet_I",3.5E-4,"A","from 700-001-011, page 31 (max. value)"]
["Duty Cycle","DC_I",0.6,null,"from 700-001-011, page 6 - Ladephase 60% (Ex 80%), Kommunikationszyklen 40% (Ex 20%)"]
["Max. answer current resistor","Rans_I",290,"Ohm","290 Ohm = (9.6V / 16.8mA) - 280 Ohm / Detector has 280R resistor"]
["Max. cable resistor","Rcbl_I",120,"Ohm"]
["Max. FET resistor","Rdet_I",0.55000000000000004,"Ohm","from 700-001-011, page 31"]
[]
[]
[]
[]
["Formula 1:"]
[]
[]
[]
[]
[]
[]
[]
[]
[]
[]
["Formula 2:"]

{"sheet":"Testing_Translation","index":19,"n_rows":61,"n_cols":2,"rows_kept":61,"cut":false,"hidden":true,"merged":[]}
["Testing Quantities Tool"]
[]
["TC1: Open File"]
[null,"- Cursor at correct sheet \"cover\""]
[null,"- Correct sheet visible: \"cover, instruction, Fx72x_Panel\""]
[null,"- Every inputs at correct initialiaze value (values set to 0,...)"]
[]
["TC2: Switch station type"]
[null,"- All station type could be choosed"]
[null,"- Switching from every station type to each other station type possible"]
[]
["TC3: Display correct station type"]
[null,"- Correct display of station type at \"Fx72x_Panel\" and correct additional sheet"]
[null,"- All add ons could be choosed"]
[null,"- Check if different linecards could be choosed on CC2 and CC5. Switching between linecard,…"]
[null,"- Check if power and batterie calculation shows correct values, change standby time, loads,…"]
[]
["TC4: Maximum configuration"]
[null,"- Maximum configuration with each station type possible"]
[null,"- Check that QT has no failure if wrong input is used, e.g. character instead of number, …"]
[]
["TC5: Linecard calculation"]
[null,"- Check correct calculation compared to older linecards if possible"]
[null,"- Check new function"]
[]
[]
["TC6: Power calculation"]
[null,"- Test if power calculation works correct, entrys from different sheets are summariesed correct"]
[null,"- Correct failure message handling"]
[null,"- Check power calculation compared to older quantities tools"]
[]
["TC7: Data and Naming"]
[null,"- Correct names and value used"]
[null,"- Data from Quantities Tool are identical to documentation"]
[]
["TC8: System"]
[null,"- Test quantitites tool with different systems (Windows7, Windows10, ...) \n  and with different office version (2003, 2007, 2010,...)"]
[]
[]
["Translation Quantities Tool"]
[]
["Attention:","After translation, no more further support/update is possible!"]
[]
["Step1:","Open a original \"…A6V10211118_.._en_--_FX7210-QuantitiesTool.xls\""]
["Step2:","Translate text on the sheet \"Cover\" and \"Instructions\""]
["Step3:","Change to Developement view under \"View/Custom_Views..\", choose \"Developement\" and push \"Show\""]
["Step4:","Translate text in the sheet \"Fx720x_Panel\" (do nothing change in fields with blue, green and red background!)"]
["Step5:","Translate text in the sheet \"FDnet_Ref\"  (do nothing change in fields with blue, green and red background!)"]
["Step6:","Translate text in the sheet \"CardCage5_Ref\" (do nothing change in fields with blue, green and red background!)"]
["Step7:","Translate text in the sheet \"CardCage2_Ref\" (do nothing change in fields with blue, green and red background!)"]
["Step8:","Translate text in the sheet \"CardCageCPU_Ref\" (do nothing change in fields with blue, green and red background!)"]
["Step9:","Translate text in the sheet \"MS9i_Ref\" (do nothing change in fields with blue, green and red background!)"]
["Step10:","Translate text in the sheet \"Collective_Ref\" (do nothing change in fields with blue, green and red background!)"]
["Step11:","Translate text in the sheet \"AnalogPlus_Ref\" (do nothing change in fields with blue, green and red background!)"]
["Step12:","Translate text in the sheet \"Interactive_Ref\" (do nothing change in fields with blue, green and red background!)"]
["Step13:","Change to EndUser view under \"View/Custom_Views..\", choose \"EndUser\" and push \"Show\""]
["Step14:","Open Visual Basic Editor under \"Developer/Visual Basic\""]
["Step15:","Be sure that in Visual Basic Editor \"Modul1\" is active"]
["Step16:","Change strings at top chapter \"Text strings which can be changed to country language\", all strings inside \" \""]
["Step17:","Close Visual Basic Editor"]
["Step18:","Safe File"]